program: Orca
programVersion: 6.1.x
elementType: C C C C C C H H H H C H H H C C C C H C H C H H H C O H
charge: 1
multiplicity: 1
keywords: wb97x-d3bj def2-tzvppd def2/J tightscf defgrid3
formula: C14H13O
InChI: InChI=1/C14H13O/c15-14-10-8-13(9-11-14)7-6-12-4-2-1-3-5-12/h1-5,7-11,15H,6H2
28 atoms
C  -0.381666 -3.688167 0.148938
C  0.283709 -3.1811 1.286907
C  0.837565 -1.94108 1.223946
C  0.759086 -1.147383 0.032379
C  0.076317 -1.694381 -1.100865
C  -0.480942 -2.933477 -1.046525
H  0.333118 -3.795028 2.177143
H  1.351497 -1.532074 2.087164
H  0.003409 -1.118872 -2.014699
H  -0.996617 -3.352475 -1.903944
C  1.343115 0.096163 0.024818
H  1.842248 0.407113 0.940954
H  2.317864 1.523114 -1.182752
H  0.944951 0.745855 -1.992291
C  0.401843 2.210409 -0.476469
C  -0.978591 2.02907 -0.493115
C  0.942085 3.361691 0.08849
C  -1.815978 3.006741 0.024941
H  -1.404804 1.127911 -0.924062
C  0.10349 4.337006 0.610287
H  2.017442 3.507767 0.102743
C  -1.274608 4.160619 0.578545
H  -2.890581 2.868994 -0.003588
H  0.526769 5.239358 1.035837
H  -1.927692 4.924823 0.983543
C  1.312753 1.11986 -1.038919
O  -0.901004 -4.894877 0.260383
H  -1.338965 -5.180177 -0.553876
totalener: -616.71965856062525 hartree
nucrepener: 871.10532138494989 hartree
electener: -1487.82497806906008 hartree
oneelecener: -2545.08520103436649 hartree
twoeener: 1057.26022296530641 hartree
kineticenergy: 613.99712642517716 hartree
exchangeener: -57.418367489391 hartree
correlationener: -4.310517956645 hartree
xcener: -61.728885446036 hartree
energy: -528.8407 -286.9553 -285.7685 -284.9759 -284.8707 -284.6099 -284.4002 -284.1399 -283.9634 -283.4578 -282.8836 -282.8042 -282.6553 -282.6190 -282.5867 -37.9341 -32.2117 -30.8274 -29.9643 -29.1671 -28.4861 -27.1454 -26.8074 -25.6259 -25.3575 -23.6500 -23.1773 -23.1143 -22.5382 -21.7871 -20.7522 -20.4769 -19.8716 -19.6352 -19.5006 -19.4852 -18.8579 -18.5939 -18.2670 -17.9643 -17.7814 -17.6036 -17.1851 -17.0885 -16.6850 -16.2453 -15.4077 -15.2657 -14.6093 -13.9847 -12.6286 -12.4888 -5.5236 -2.7012 -1.8173 -1.7908 -1.4810 -1.3849 -1.1835 -1.0432 -0.7796 -0.5683 -0.4534 electronvolt
chargesum: 1.0000000
charge: 0.826014 -0.170761 -0.025683 0.331181 -0.156117 -0.136105 0.003574 -0.052057 -0.077054 -0.141762 0.129828 -0.047059 0.093477 0.123465 0.345673 0.151370 -0.295809 -0.226987 -0.046333 -0.014894 -0.076743 -0.036058 0.007081 0.014747 0.028285 0.550788 -0.288862 0.186801
charge: -0.184889 0.121345 0.122846 -0.147381 0.119985 0.114853 0.036951 0.037022 0.024759 0.031200 0.184418 0.050605 0.040987 0.020031 -0.170692 0.048517 0.053001 0.036508 0.014846 0.039371 0.018557 0.036490 0.011442 0.012990 0.012517 0.040594 0.377350 -0.104226
qa: 0.8260 -0.1708 -0.0257 0.3312 -0.1561 -0.1361 0.0036 -0.0521 -0.0771 -0.1418 0.1298 -0.0471 0.0935 0.1235 0.3457 0.1514 -0.2958 -0.2270 -0.0463 -0.0149 -0.0767 -0.0361 0.0071 0.0147 0.0283 0.5508 -0.2889 0.1868
va: 2.7896 3.3967 3.1076 1.5178 3.7255 3.4869 0.9832 0.9545 0.9140 0.9636 3.2208 0.9480 0.9973 0.9037 2.3662 3.3346 3.4553 3.3667 0.8558 3.3601 0.9683 3.3600 0.9405 0.9374 0.9257 2.9677 2.1137 1.0091
dispersion: -0.063947430 hartree
energy: -616.783605990176 hartree
dipole: 0.722112609 -0.404530952 0.317581657 5.210336080 -7.209606656 -1.999270576 -1.245255809 0.833074614 -0.412181194
dipolemethod: SCF
magnitude: 2.065873733 au
magnitude: 5.251033724 debye
