program: Orca
programVersion: 6.1.x
elementType: C C C C C C H H H H H C H H H C C C C H C H C H H H C
charge: 1
multiplicity: 1
keywords: wb97x-d3bj def2-tzvppd def2/J tightscf defgrid3
formula: C14H13
InChI: InChI=1/C14H13/c1-3-7-11(8-4-1)13-14(15-13)12-9-5-2-6-10-12/h1-10,13-14H
27 atoms
C  -0.245053 -4.676082 0.08929
C  1.015728 -4.196145 -0.24508
C  1.237852 -2.830424 -0.296046
C  0.194068 -1.940578 -0.021225
C  -1.069852 -2.430992 0.327898
C  -1.284696 -3.795698 0.380411
H  -0.418921 -5.74503 0.135661
H  1.822999 -4.885382 -0.460643
H  2.220763 -2.448859 -0.552992
H  -1.877167 -1.755453 0.586987
H  -2.258517 -4.179098 0.659888
C  0.481223 -0.511312 -0.093365
H  1.527654 -0.216505 -0.053412
H  0.086757 0.009763 -1.236214
H  -1.504494 0.231156 -0.263977
C  -0.188644 1.954684 -0.039339
C  -1.183531 2.846287 -0.454207
C  1.013943 2.44285 0.485359
C  -0.970483 4.211638 -0.367422
H  -2.120782 2.466365 -0.847826
C  1.219518 3.807203 0.572757
H  1.776806 1.76581 0.852595
C  0.231122 4.689414 0.142111
H  -1.739453 4.90228 -0.691322
H  2.144576 4.188835 0.987556
H  0.396975 5.758057 0.216473
C  -0.462775 0.525876 -0.156897
totalener: -541.41645663278871 hartree
nucrepener: 751.12350982392445 hartree
electener: -1292.53996343583026 hartree
oneelecener: -2202.88517069808904 hartree
twoeener: 910.34520726225878 hartree
kineticenergy: 538.94968168443518 hartree
exchangeener: -51.605766662158 hartree
correlationener: -3.944867708069 hartree
xcener: -55.550634370227 hartree
energy: -286.4111 -286.3971 -284.2500 -284.2499 -283.8189 -283.8187 -283.7939 -283.7938 -283.5173 -283.5171 -283.3922 -283.3920 -283.3534 -283.3533 -32.6858 -31.3193 -30.7349 -28.7241 -28.0182 -28.0096 -27.6385 -25.4660 -24.1657 -24.0605 -23.6985 -22.9216 -21.8772 -21.8248 -20.3517 -20.1728 -20.0960 -19.6035 -19.1623 -18.7659 -18.4718 -18.3958 -18.3804 -17.9875 -17.4556 -16.9119 -16.3938 -16.2335 -16.1277 -15.9845 -14.0259 -13.4374 -13.4331 -13.0496 -4.8327 -2.5451 -2.0662 -2.0104 -1.8310 -1.4284 -0.9963 -0.9467 -0.8364 -0.4964 -0.4359 electronvolt
chargesum: 1.0000000
charge: 0.018724 -0.115831 -0.164739 0.388543 -0.063455 -0.199652 0.036199 0.021434 -0.076088 -0.088531 0.014873 0.692383 0.010130 0.050994 0.010746 0.389476 -0.166185 -0.062496 -0.114502 -0.076519 -0.201301 -0.088009 0.020376 0.021462 0.014746 0.035315 0.691907
charge: 0.063353 0.053222 0.072466 -0.163266 0.072377 0.053684 0.020087 0.017818 0.023687 0.015357 0.017841 0.127817 0.050467 0.150214 0.050450 -0.163290 0.072466 0.072359 0.053216 0.023686 0.053680 0.015373 0.063350 0.017819 0.017840 0.020085 0.127844
qa: 0.0187 -0.1158 -0.1647 0.3885 -0.0635 -0.1997 0.0362 0.0214 -0.0761 -0.0885 0.0149 0.6924 0.0101 0.0510 0.0107 0.3895 -0.1662 -0.0625 -0.1145 -0.0765 -0.2013 -0.0880 0.0204 0.0215 0.0147 0.0353 0.6919
va: 3.3603 3.4574 3.2963 1.1673 3.2555 3.4630 0.9242 0.9340 0.9826 0.9663 0.9348 2.1667 0.9312 0.9027 0.9312 1.1631 3.2978 3.2573 3.4565 0.9829 3.4633 0.9663 3.3587 0.9337 0.9347 0.9243 2.1660
dispersion: -0.059663709 hartree
energy: -541.476120341697 hartree
dipole: 0.059139858 -0.033998782 0.025141077 0.001852399 -0.001250037 0.000602362 -0.842772263 0.481007147 -0.361765116
dipolemethod: SCF
magnitude: 0.362638161 au
magnitude: 0.921752953 debye
