program: Orca
programVersion: 6.1.x
elementType: C C C C C C H H H C H H H C C C C H C H C H H H C H C H H H
charge: 1
multiplicity: 1
keywords: wb97x-d3bj def2-tzvppd def2/J tightscf defgrid3
formula: C15H15
InChI: InChI=1/C15H15/c1-11-6-5-9-13(10-11)15-14(16-15)12-7-3-2-4-8-12/h2-10,14-15H,1H3
30 atoms
C  -0.721603 -4.216538 0.250887
C  0.576246 -3.860043 -0.122624
C  0.876485 -2.508217 -0.209294
C  -0.09261 -1.534485 0.059972
C  -1.380915 -1.912922 0.444552
C  -1.687686 -3.259515 0.536527
H  1.878573 -2.201346 -0.49431
H  -2.131022 -1.173798 0.701002
H  -2.679748 -3.56815 0.843629
C  0.301937 -0.133148 -0.058808
H  1.36757 0.083793 -0.032448
H  -0.058118 0.372982 -1.209551
H  -1.625073 0.747599 -0.232786
C  -0.186109 2.375743 -0.066684
C  -1.121936 3.325859 -0.489631
C  1.057926 2.789944 0.424678
C  -0.810211 4.674095 -0.443766
H  -2.091057 3.00423 -0.857106
C  1.362331 4.137586 0.470896
H  1.776903 2.069276 0.797249
C  0.431728 5.07714 0.032562
H  -1.533562 5.409682 -0.773741
H  2.319911 4.462418 0.859426
H  0.675011 6.132646 0.074734
C  -0.564089 0.969001 -0.139088
H  -0.976694 -5.268357 0.33144
C  1.60856 -4.916643 -0.412416
H  2.565417 -4.473601 -0.690009
H  1.765929 -5.549354 0.463919
H  1.279637 -5.561038 -1.23072
totalener: -580.76947246758709 hartree
nucrepener: 846.42582804959341 hartree
electener: -1427.19529833892648 hartree
oneelecener: -2444.72432229122751 hartree
twoeener: 1017.52902395230092 hartree
kineticenergy: 578.08950101482264 hartree
exchangeener: -55.480717814401 hartree
correlationener: -4.264699592368 hartree
xcener: -59.745417406769 hartree
energy: -286.3514 -286.2728 -284.2073 -284.0929 -283.7881 -283.7655 -283.6027 -283.5233 -283.4946 -283.4618 -283.3635 -283.3248 -283.2664 -283.2361 -282.3693 -32.5944 -31.2440 -30.6792 -28.7359 -28.2296 -27.9786 -27.5985 -25.7082 -25.3364 -24.0850 -23.6880 -23.6027 -22.5465 -21.8163 -21.3504 -20.2547 -20.1067 -20.0482 -19.3816 -19.2078 -18.5243 -18.4489 -18.3634 -18.0083 -17.8009 -17.6565 -17.1969 -16.6446 -16.4091 -16.2979 -16.0461 -15.8433 -15.7049 -13.8871 -13.4061 -13.0630 -12.8224 -4.7510 -2.4741 -2.0068 -1.8198 -1.7695 -1.3714 -0.9368 -0.8978 -0.7922 -0.4714 -0.4098 electronvolt
chargesum: 1.0000000
charge: -0.041897 0.320600 -0.028506 0.490353 -0.112683 -0.284306 -0.183865 -0.082182 0.003913 0.705332 -0.008688 0.046877 0.010700 0.376815 -0.165756 -0.075696 -0.117155 -0.075984 -0.197248 -0.087514 0.022211 0.020034 0.014344 0.035936 0.651902 -0.031730 -0.529770 0.074428 0.125588 0.123944
charge: 0.084120 -0.167688 0.095361 -0.159242 0.068220 0.057254 0.026359 0.013961 0.017855 0.125532 0.050062 0.149862 0.050382 -0.163047 0.072882 0.072939 0.053016 0.023713 0.053473 0.015359 0.063291 0.017695 0.017699 0.019995 0.130365 0.029257 0.180469 -0.007435 0.004296 0.003995
qa: -0.0419 0.3206 -0.0285 0.4904 -0.1127 -0.2843 -0.1839 -0.0822 0.0039 0.7053 -0.0087 0.0469 0.0107 0.3768 -0.1658 -0.0757 -0.1172 -0.0760 -0.1972 -0.0875 0.0222 0.0200 0.0143 0.0359 0.6519 -0.0317 -0.5298 0.0744 0.1256 0.1239
va: 3.3718 2.2436 2.5909 1.1297 3.2318 3.4797 1.0051 0.9579 0.9373 2.0458 0.9486 0.8987 0.9355 1.1604 3.2896 3.2648 3.4585 0.9835 3.4481 0.9687 3.3578 0.9348 0.9349 0.9239 2.1548 0.9768 3.7710 1.0568 1.0377 1.0377
dispersion: -0.065172052 hartree
energy: -580.834644519596 hartree
dipole: 2.495884350 -2.530298615 -0.034414265 -5.644064105 6.119232115 0.475168011 -1.494813156 1.145584718 -0.349228437
dipolemethod: SCF
magnitude: 0.590702532 au
magnitude: 1.501446514 debye
