program: Orca
programVersion: 6.1.x
elementType: C C C C C C H H H H C H H H C C C C H C H C H H H C N O O
charge: 1
multiplicity: 1
keywords: wb97x-d3bj def2-tzvppd def2/J tightscf defgrid3
formula: C14H12NO2
InChI: InChI=1/C14H12NO2/c16-15(17)12-8-6-11(7-9-12)14-13(18-14)10-4-2-1-3-5-10/h1-9,13-14H
29 atoms
C  0.001272 -3.443616 0.017696
C  1.244387 -2.939399 -0.318731
C  1.40063 -1.564406 -0.358139
C  0.317933 -0.724178 -0.072486
C  -0.924342 -1.268857 0.278958
C  -1.086707 -2.640361 0.32327
H  2.05949 -3.61562 -0.537962
H  2.365289 -1.140675 -0.615625
H  -1.758901 -0.631674 0.545471
H  -2.028446 -3.095901 0.597859
C  0.543784 0.712947 -0.127683
H  1.579127 1.04806 -0.129802
H  0.0490 1.287549 -1.289138
H  -1.474345 1.382931 -0.258936
C  -0.211092 3.155956 -0.06014
C  -1.229874 4.019017 -0.47305
C  0.971026 3.67428 0.477823
C  -1.060169 5.389686 -0.369383
H  -2.152341 3.615395 -0.878044
C  1.133198 5.044104 0.582326
H  1.75278 3.018691 0.845074
C  0.121634 5.900079 0.154287
H  -1.84862 6.058879 -0.691558
H  2.04285 5.448881 1.00915
H  0.25309 6.972412 0.241875
C  -0.439298 1.7129 -0.200648
N  -0.1752 -4.922533 0.067338
O  -1.275245 -5.329765 0.365857
O  0.795092 -5.595766 -0.19642
totalener: -746.01459592690742 hartree
nucrepener: 1033.67226558245670 hartree
electener: -1779.68686076977497 hartree
oneelecener: -3043.09546774020646 hartree
twoeener: 1263.40860697043149 hartree
kineticenergy: 742.89053998918371 hartree
exchangeener: -67.573168146802 hartree
correlationener: -4.953507259613 hartree
xcener: -72.526675406416 hartree
energy: -526.9309 -526.9303 -402.0392 -287.0407 -286.5540 -285.3130 -284.9769 -284.5498 -284.5392 -284.4156 -284.1917 -284.1686 -283.9240 -283.8806 -283.5817 -283.4968 -283.4534 -40.6491 -35.7993 -33.0774 -32.0044 -31.1215 -29.6731 -28.8094 -28.2942 -28.0892 -26.7503 -25.3125 -24.7528 -24.0906 -23.6657 -23.2623 -22.4295 -22.0410 -21.5443 -21.3129 -20.8436 -20.4885 -20.1819 -19.9575 -19.5761 -19.5576 -19.1722 -18.8279 -18.5667 -18.4947 -18.0053 -17.7916 -17.1991 -16.8646 -16.4002 -16.1688 -14.6133 -14.6036 -14.5772 -14.3170 -14.1115 -13.5377 -13.3913 -5.4540 -3.2836 -2.6914 -2.6051 -2.1366 -1.8356 -1.6697 -1.1233 -1.0585 -1.0099 -0.6907 electronvolt
chargesum: 1.0000000
charge: -0.036358 -0.065633 -0.109383 0.428301 -0.068869 -0.105595 0.021022 -0.090668 -0.078158 0.017447 0.557995 0.021294 0.045935 -0.006089 0.395092 -0.164117 -0.061960 -0.111913 -0.074454 -0.199706 -0.093953 0.009347 0.020924 0.014681 0.035809 0.777799 0.890900 -0.485576 -0.484116
charge: -0.062057 0.123026 0.100692 -0.148782 0.101007 0.122971 0.029380 0.030025 0.021797 0.028956 0.154092 0.052177 0.154704 0.051382 -0.163219 0.070029 0.068137 0.053631 0.023610 0.053545 0.014557 0.062291 0.018215 0.018095 0.020135 0.112003 -0.334386 0.111428 0.112556
qa: -0.0364 -0.0656 -0.1094 0.4283 -0.0689 -0.1056 0.0210 -0.0907 -0.0782 0.0174 0.5580 0.0213 0.0459 -0.0061 0.3951 -0.1641 -0.0620 -0.1119 -0.0745 -0.1997 -0.0940 0.0093 0.0209 0.0147 0.0358 0.7778 0.8909 -0.4856 -0.4841
va: 3.4325 3.4407 3.2113 0.8850 3.2802 3.3956 0.9742 0.9904 0.9661 0.9775 2.0564 0.9251 0.9035 0.9454 1.1677 3.2941 3.2571 3.4564 0.9799 3.4713 0.9618 3.3682 0.9334 0.9342 0.9251 2.1768 3.7112 1.7890 1.7892
dispersion: -0.066146823 hartree
energy: -746.080742749712 hartree
dipole: 0.773704849 -0.460739080 0.312965768 19.836113269 -16.022798238 3.813315031 -1.123414428 0.669965781 -0.453448647
dipolemethod: SCF
magnitude: 3.852912505 au
magnitude: 9.793325300 debye
