program: Orca
programVersion: 6.1.x
elementType: C C C C C C H H H H C H H H C C C C H C H C H H H C Cl
charge: 1
multiplicity: 1
keywords: wb97x-d3bj def2-tzvppd def2/J tightscf defgrid3
formula: C14H12Cl
InChI: InChI=1/C14H12Cl/c15-12-8-6-11(7-9-12)14-13(16-14)10-4-2-1-3-5-10/h1-9,13-14H
27 atoms
C  -0.042769 -3.763114 0.02344
C  1.185034 -3.24686 -0.376242
C  1.351671 -1.876076 -0.42735
C  0.298153 -1.018784 -0.090413
C  -0.926399 -1.557961 0.3231
C  -1.098797 -2.925847 0.379375
H  1.993407 -3.91737 -0.637459
H  2.307747 -1.465874 -0.735637
H  -1.743824 -0.916108 0.630896
H  -2.036541 -3.355278 0.707534
C  0.533411 0.41833 -0.168153
H  1.570379 0.746656 -0.184032
H  0.061837 0.931851 -1.277805
H  -1.482005 1.099966 -0.211569
C  -0.210552 2.860123 -0.041962
C  -1.259098 3.722528 -0.380778
C  1.00709 3.382967 0.410778
C  -1.085816 5.093097 -0.29037
H  -2.206813 3.315578 -0.718349
C  1.172901 4.752251 0.502018
H  1.813903 2.728178 0.719788
C  0.130031 5.605244 0.147052
H  -1.896237 5.761079 -0.555314
H  2.109702 5.160542 0.861331
H  0.26522 6.678003 0.224315
C  -0.445384 1.425952 -0.159299
Cl -0.259834 -5.466498 0.096964
totalener: -1001.02536969887115 hartree
nucrepener: 917.91656851588687 hartree
electener: -1918.94193458634300 hartree
oneelecener: -3168.95440855274137 hartree
twoeener: 1250.01247396639837 hartree
kineticenergy: 997.83505329179695 hartree
exchangeener: -71.926448406884 hartree
correlationener: -4.817632196624 hartree
xcener: -76.744080603508 hartree
energy: -2765.7935 -286.4874 -286.4539 -285.1862 -284.3709 -284.3093 -284.0540 -284.0236 -283.8812 -283.8572 -283.6377 -283.5934 -283.5790 -283.4469 -283.4072 -263.4198 -202.3379 -202.0892 -202.0671 -32.7731 -31.7941 -31.0969 -30.1735 -28.5313 -28.2976 -28.0626 -27.3503 -25.3983 -24.4075 -24.0932 -23.7093 -23.0479 -21.9760 -21.8945 -20.4179 -20.3077 -20.0200 -19.7162 -19.4341 -18.8742 -18.6763 -18.5938 -18.4606 -18.0878 -17.8505 -17.2014 -16.7823 -16.4891 -16.3407 -16.1037 -15.6886 -14.5796 -13.7926 -13.6888 -13.4925 -12.7512 -4.9273 -2.6530 -2.2555 -2.1029 -1.9302 -1.5004 -1.1237 -0.9893 -0.9040 -0.5663 -0.5208 electronvolt
chargesum: 1.0000000
charge: 0.420071 -0.250833 -0.018348 0.332707 0.068221 -0.309720 -0.014035 -0.072158 -0.076183 -0.018193 0.701035 0.008548 0.049992 0.007618 0.392391 -0.167134 -0.063385 -0.116942 -0.077579 -0.203127 -0.088729 0.021895 0.021190 0.015147 0.036103 0.640068 -0.238620
charge: -0.603027 0.012817 0.078903 -0.161055 0.079125 0.013483 0.016834 0.027338 0.018840 0.016552 0.123857 0.050532 0.149855 0.050591 -0.163620 0.073272 0.073114 0.053929 0.023857 0.054365 0.015475 0.064639 0.018100 0.018101 0.020449 0.129444 0.744229
qa: 0.4201 -0.2508 -0.0183 0.3327 0.0682 -0.3097 -0.0140 -0.0722 -0.0762 -0.0182 0.7010 0.0085 0.0500 0.0076 0.3924 -0.1671 -0.0634 -0.1169 -0.0776 -0.2031 -0.0887 0.0219 0.0212 0.0151 0.0361 0.6401 -0.2386
va: 3.0532 3.7603 3.1545 1.1098 3.0979 3.7192 0.9236 0.9700 0.9486 0.9226 2.0618 0.9283 0.9032 0.9319 1.1528 3.2900 3.2511 3.4596 0.9832 3.4616 0.9675 3.3612 0.9341 0.9348 0.9241 2.2203 1.0171
dispersion: -0.064594279 hartree
energy: -1001.089963978065 hartree
dipole: 1.110625274 -0.974305902 0.136319372 24.092858245 -21.742025013 2.350833232 -1.255084319 0.844840931 -0.410243388
dipolemethod: SCF
magnitude: 2.390250927 au
magnitude: 6.075535026 debye
