program: Orca
programVersion: 6.1.x
elementType: C C C C C C H H H H C H H H C C C C H C H C H H H C N C C H H C H H C H H H H
charge: 1
multiplicity: 1
keywords: wb97x-d3bj def2-tzvppd def2/J tightscf defgrid3
formula: C18H20N
InChI: InChI=1/C18H20N/c1-2-6-16(7-3-1)8-9-17-10-12-18(13-11-17)19-14-4-5-15-19/h1-3,6-8,10-13H,4-5,9,14-15H2
39 atoms
C  0.092091 -2.659247 -0.014284
C  1.367992 -2.067383 -0.189802
C  1.504601 -0.701957 -0.226466
C  0.398814 0.151211 -0.096009
C  -0.864242 -0.429943 0.090652
C  -1.022564 -1.792342 0.133071
H  2.246433 -2.691252 -0.278261
H  2.495497 -0.277309 -0.357864
H  -1.743296 0.190775 0.230402
H  -2.010014 -2.205332 0.285714
C  0.614676 1.59232 -0.172505
H  1.619883 1.942986 0.052425
H  0.442184 1.998031 -1.31979
H  -1.385445 2.238799 -0.530222
C  -0.222788 4.004696 -0.076299
C  -1.249384 4.850116 -0.524513
C  0.90986 4.555209 0.545303
C  -1.136695 6.220485 -0.376438
H  -2.13029 4.423315 -0.992808
C  1.015661 5.924098 0.691349
H  1.69163 3.914786 0.936076
C  -0.003454 6.754625 0.227222
H  -1.927956 6.872538 -0.725513
H  1.884387 6.351583 1.177087
H  0.084411 7.828357 0.348838
C  -0.39176 2.583717 -0.252007
N  -0.057088 -3.99454 0.025389
C  -1.327182 -4.668669 0.307283
C  1.03647 -4.943418 -0.199727
H  -1.811738 -4.228725 1.181914
H  -2.007016 -4.576244 -0.54777
C  -0.914546 -6.12106 0.543397
H  1.601418 -4.674395 -1.095095
H  1.723283 -4.944357 0.654814
C  0.319015 -6.284553 -0.346383
H  -0.64346 -6.262303 1.592715
H  -1.714736 -6.820345 0.301987
H  0.016971 -6.430597 -1.386584
H  0.951164 -7.123084 -0.055178
totalener: -752.99195634981061 hartree
nucrepener: 1253.44883242276160 hartree
electener: -2006.44078660308492 hartree
oneelecener: -3485.47473086987702 hartree
twoeener: 1479.03394426679210 hartree
kineticenergy: 749.47980502144526 hartree
exchangeener: -71.562542232199 hartree
correlationener: -5.514654882340 hartree
xcener: -77.077197114539 hartree
energy: -395.6582 -286.0053 -285.2109 -284.0467 -283.9907 -283.6862 -283.6817 -283.4662 -283.2499 -283.2188 -283.1174 -283.0824 -283.0539 -283.0391 -283.0200 -282.5422 -282.4581 -282.0161 -282.0095 -32.8644 -31.8936 -30.8331 -30.0084 -28.5427 -27.9327 -27.8136 -27.3714 -26.4456 -26.3797 -24.9397 -23.8931 -23.6533 -23.4443 -22.7031 -21.9738 -21.8514 -21.4592 -21.1513 -20.3014 -19.9637 -19.7308 -19.4532 -19.2148 -18.7788 -18.4199 -18.2718 -18.1817 -17.8170 -17.6927 -17.4440 -17.3197 -17.0348 -16.8442 -16.7007 -16.2054 -16.0842 -16.0102 -15.8578 -15.0379 -14.9554 -14.8714 -14.4350 -14.0607 -13.3030 -13.2922 -12.8281 -10.6289 -4.5386 -1.9501 -1.7550 -1.4191 -1.2961 -1.0843 -0.8186 -0.7172 -0.4458 -0.2898 -0.1969 electronvolt
chargesum: 1.0000000
charge: 1.105460 -0.221305 -0.389202 0.484334 -0.376393 -0.126164 -0.058812 -0.151431 -0.150264 -0.069412 1.004000 -0.050048 0.032079 0.003103 0.385719 -0.143168 -0.060926 -0.137327 -0.075261 -0.232306 -0.083759 0.056486 0.014561 0.011409 0.036491 0.239871 0.030108 -0.376335 -0.365798 0.070852 0.140190 -0.043039 0.081514 0.138773 -0.062122 0.102391 0.067552 0.100021 0.068158
charge: -0.161199 0.087196 0.058430 -0.181967 0.059621 0.090378 0.000850 0.023144 0.013530 0.000747 0.068091 0.044057 0.143938 0.044758 -0.164742 0.077778 0.080661 0.052667 0.023871 0.053944 0.015930 0.066899 0.017300 0.017491 0.020288 0.154515 -0.007586 0.009872 0.010045 0.028449 0.039277 0.025671 0.029261 0.039552 0.025684 0.024760 0.021027 0.024672 0.021140
qa: 1.1055 -0.2213 -0.3892 0.4843 -0.3764 -0.1262 -0.0588 -0.1514 -0.1503 -0.0694 1.0040 -0.0500 0.0321 0.0031 0.3857 -0.1432 -0.0609 -0.1373 -0.0753 -0.2323 -0.0838 0.0565 0.0146 0.0114 0.0365 0.2399 0.0301 -0.3763 -0.3658 0.0709 0.1402 -0.0430 0.0815 0.1388 -0.0621 0.1024 0.0676 0.1000 0.0682
va: 1.8532 3.4476 3.0681 0.5776 3.0589 3.3918 0.9239 1.0076 0.9573 0.9336 1.6685 0.9274 0.9168 0.9531 1.1782 3.2736 3.2594 3.4505 0.9845 3.4443 0.9834 3.3381 0.9385 0.9398 0.9224 2.3492 2.9101 4.4034 4.3868 1.0413 1.0024 4.0625 1.0366 0.9995 4.0968 1.0106 1.0659 1.0137 1.0658
dispersion: -0.086059543 hartree
energy: -753.078015892410 hartree
dipole: -0.586294213 0.543913129 -0.042381083 -14.585931867 16.587658781 2.001726913 -0.538699560 0.210265791 -0.328433769
dipolemethod: SCF
magnitude: 2.028934580 au
magnitude: 5.157141859 debye
