program: Orca
programVersion: 6.1.x
elementType: C C C C C C H H H C H H H C C C C H C H C H H H C C H F F F
charge: 1
multiplicity: 1
keywords: wb97x-d3bj def2-tzvppd def2/J tightscf defgrid3
formula: C15H12F3
InChI: InChI=1/C15H12F3/c16-15(17,18)12-8-4-7-11(9-12)14-13(19-14)10-5-2-1-3-6-10/h1-9,13-14H
30 atoms
C  -1.493935 -3.090054 0.307011
C  -0.14708 -2.867559 0.039073
C  0.339137 -1.577368 -0.052304
C  -0.53176 -0.495266 0.116707
C  -1.883548 -0.721766 0.399637
C  -2.35919 -2.017496 0.49177
H  1.3908 -1.4094 -0.254378
H  -2.560416 0.105882 0.577271
H  -3.402118 -2.197985 0.720807
C  0.02901 0.845533 0.014318
H  1.110423 0.934293 0.094954
H  -0.213367 1.413215 -1.18703
H  -1.761682 1.949637 -0.311849
C  -0.141876 3.394658 -0.075795
C  -0.908299 4.441508 -0.597005
C  1.095136 3.662016 0.520766
C  -0.433221 5.741136 -0.542787
H  -1.873793 4.234607 -1.047386
C  1.562655 4.962402 0.575091
H  1.68158 2.868229 0.969688
C  0.802163 5.998995 0.039394
H  -1.025464 6.552012 -0.948946
H  2.515034 5.174583 1.045624
H  1.172431 7.016567 0.088073
C  -0.687366 2.039251 -0.165669
C  0.76906 -4.055192 -0.170367
H  -1.86391 -4.106017 0.386618
F  0.584794 -4.977961 0.783803
F  2.060625 -3.690463 -0.152263
F  0.52442 -4.638806 -1.354369
totalener: -878.63101768934814 hartree
nucrepener: 1190.39703703199257 hartree
electener: -2069.02805353782878 hartree
oneelecener: -3544.00129983028819 hartree
twoeener: 1474.97324629245963 hartree
kineticenergy: 875.09784308434041 hartree
exchangeener: -76.458617722345 hartree
correlationener: -5.442970717815 hartree
xcener: -81.901588440160 hartree
energy: -677.6351 -677.5271 -677.4865 -289.5038 -286.7657 -286.5056 -284.6796 -284.3452 -284.3279 -284.3021 -284.1781 -284.0917 -283.8779 -283.8460 -283.8394 -283.5543 -283.4493 -283.4105 -42.3376 -39.9010 -39.7896 -32.9266 -31.7250 -30.9992 -29.1976 -28.8141 -28.0895 -27.9253 -26.1160 -25.6995 -24.5120 -24.2137 -23.9431 -23.3505 -22.5549 -22.3232 -22.2751 -21.9459 -21.1055 -20.6729 -20.4317 -20.2869 -19.5764 -19.5017 -19.0073 -18.8982 -18.7630 -18.6494 -18.4696 -18.2961 -18.0472 -17.7029 -17.6593 -17.5541 -17.1932 -17.0773 -16.7732 -16.3754 -16.2164 -16.0898 -14.3243 -13.9378 -13.4929 -13.2701 -5.1011 -2.7483 -2.5702 -2.1620 -2.0152 -1.5808 -1.2730 -1.0355 -0.9554 -0.5734 -0.5108 electronvolt
chargesum: 1.0000000
charge: -0.359496 0.305005 -0.115647 0.592363 -0.150759 -0.229654 -0.091344 -0.080259 0.003741 0.643991 0.012078 0.047501 0.001848 0.375283 -0.164859 -0.076205 -0.110513 -0.075602 -0.197180 -0.089545 0.014927 0.019446 0.014176 0.035771 0.749009 0.645617 -0.061852 -0.219253 -0.235460 -0.203126
charge: 0.119748 -0.052277 0.131139 -0.142771 0.089147 0.077230 0.034658 0.019570 0.022903 0.143599 0.052779 0.152361 0.051262 -0.163230 0.071023 0.070469 0.053433 0.023545 0.053942 0.015175 0.062987 0.018026 0.018124 0.020171 0.119971 -0.580463 0.039196 0.163420 0.151045 0.163819
qa: -0.3595 0.3050 -0.1156 0.5924 -0.1508 -0.2297 -0.0913 -0.0803 0.0037 0.6440 0.0121 0.0475 0.0018 0.3753 -0.1649 -0.0762 -0.1105 -0.0756 -0.1972 -0.0895 0.0149 0.0194 0.0142 0.0358 0.7490 0.6456 -0.0619 -0.2193 -0.2355 -0.2031
va: 3.4419 2.7276 2.4639 0.9553 3.2819 3.4872 1.0005 0.9621 0.9505 2.0694 0.9370 0.8993 0.9353 1.1581 3.2780 3.2619 3.4584 0.9816 3.4606 0.9665 3.3643 0.9348 0.9354 0.9252 2.0914 3.2494 1.0175 1.0279 1.0042 1.0169
dispersion: -0.066761018 hartree
energy: -878.697778706973 hartree
dipole: -7.721822522 6.530237202 -1.191585320 34.655263713 -31.036761164 3.618502549 0.889818268 -0.969154886 -0.079336618
dipolemethod: SCF
magnitude: 3.810476423 au
magnitude: 9.685461350 debye
