program: Orca
programVersion: 6.1.x
elementType: C C C C C C H H H H C H H H C C C C H C H C H H H C C N
charge: 1
multiplicity: 1
keywords: wb97x-d3bj def2-tzvppd def2/J tightscf defgrid3
formula: C15H12N
InChI: InChI=1/C15H12N/c16-10-11-6-8-13(9-7-11)15-14(17-15)12-4-2-1-3-5-12/h1-9,14-15H
28 atoms
C  -0.03966 -3.930581 0.032171
C  1.187097 -3.404558 -0.371172
C  1.349992 -2.032698 -0.421569
C  0.290392 -1.183998 -0.080807
C  -0.933283 -1.723315 0.336838
C  -1.098819 -3.09218 0.391937
H  1.999072 -4.069657 -0.636668
H  2.302298 -1.615573 -0.731063
H  -1.749838 -1.081873 0.646079
H  -2.036124 -3.522869 0.721005
C  0.520719 0.251726 -0.152413
H  1.556369 0.581206 -0.206199
H  -0.019111 0.814503 -1.278439
H  -1.497436 0.933048 -0.174788
C  -0.217111 2.698044 -0.043452
C  -1.255933 3.564668 -0.395575
C  0.997716 3.213035 0.420808
C  -1.075043 4.934754 -0.305523
H  -2.202739 3.163704 -0.742904
C  1.171122 4.582219 0.51208
H  1.797633 2.55478 0.741005
C  0.138452 5.441254 0.144333
H  -1.878897 5.60657 -0.580717
H  2.106506 4.984495 0.881811
H  0.279125 6.513244 0.221382
C  -0.459108 1.257555 -0.165415
C  -0.216437 -5.359445 0.09214
N  -0.359601 -6.498244 0.138626
totalener: -633.69921920772640 hartree
nucrepener: 886.22129841227843 hartree
electener: -1519.92051175299434 hartree
oneelecener: -2594.53872881856978 hartree
twoeener: 1074.61821706557544 hartree
kineticenergy: 630.91103857441863 hartree
exchangeener: -59.532351787223 hartree
correlationener: -4.466581394953 hartree
xcener: -63.998933182176 hartree
energy: -395.3069 -286.9346 -286.5529 -285.0025 -284.8778 -284.4586 -284.4421 -284.4041 -284.1687 -284.1385 -283.9238 -283.8843 -283.5885 -283.5828 -283.4951 -283.4523 -33.0320 -32.0073 -31.4012 -31.0068 -29.3409 -28.7258 -28.1741 -28.0478 -26.1452 -24.8955 -24.5934 -24.0201 -23.3444 -22.6602 -22.0498 -21.7036 -20.6742 -20.4736 -19.9564 -19.6506 -19.3495 -19.0923 -18.8191 -18.5282 -18.4404 -18.1823 -17.6136 -17.2760 -16.8780 -16.4011 -16.1810 -16.0541 -15.9654 -15.2434 -14.1133 -14.0593 -13.5366 -13.2420 -5.3545 -2.9919 -2.6106 -2.3915 -2.1160 -1.6827 -1.5001 -1.1645 -1.0240 -0.6992 -0.5884 electronvolt
chargesum: 1.0000000
charge: 0.818349 -0.322511 0.063476 0.440516 0.104266 -0.378070 -0.019303 -0.078873 -0.074393 -0.027025 0.491442 0.011624 0.056237 -0.002394 0.386755 -0.164028 -0.060627 -0.114506 -0.075309 -0.202694 -0.093696 0.014965 0.021763 0.014600 0.035569 0.801791 -0.523861 -0.124064
charge: -0.152392 0.094681 0.093115 -0.150911 0.093532 0.094891 0.033540 0.028876 0.020591 0.033429 0.147168 0.051787 0.153249 0.051150 -0.163313 0.070613 0.069080 0.053704 0.023619 0.053725 0.014718 0.062775 0.018208 0.018106 0.020212 0.115478 -0.146588 0.196957
qa: 0.8183 -0.3225 0.0635 0.4405 0.1043 -0.3781 -0.0193 -0.0789 -0.0744 -0.0270 0.4914 0.0116 0.0562 -0.0024 0.3868 -0.1640 -0.0606 -0.1145 -0.0753 -0.2027 -0.0937 0.0150 0.0218 0.0146 0.0356 0.8018 -0.5239 -0.1241
va: 2.3685 3.2549 3.0519 1.1568 3.0015 3.1896 0.9966 0.9790 0.9498 1.0006 2.1285 0.9323 0.8995 0.9402 1.1464 3.2928 3.2486 3.4602 0.9805 3.4652 0.9635 3.3654 0.9339 0.9346 0.9249 2.1149 2.7926 2.5393
dispersion: -0.064960057 hartree
energy: -633.764179264965 hartree
dipole: 0.616983852 -0.349605696 0.267378156 14.637926031 -11.695675147 2.942250883 -1.107908832 0.649639068 -0.458269764
dipolemethod: SCF
magnitude: 2.989706092 au
magnitude: 7.599228965 debye
