program: Orca
programVersion: 6.1.x
elementType: C C C C C C H H H C H H H C C C C H C H C H H H C H C H H H
charge: 1
multiplicity: 1
keywords: wb97x-d3bj def2-tzvppd def2/J tightscf defgrid3
formula: C15H15
InChI: InChI=1/C15H15/c1-13-6-5-9-15(12-13)11-10-14-7-3-2-4-8-14/h2-10,12H,11H2,1H3
30 atoms
C  -1.248942 -3.476468 -0.641382
C  0.070844 -3.660466 -0.223986
C  0.733433 -2.582887 0.351144
C  0.09341 -1.357645 0.523732
C  -1.213404 -1.182355 0.086091
C  -1.885266 -2.254037 -0.490914
H  1.756214 -2.709254 0.693418
H  -1.715466 -0.22744 0.207856
H  -2.909841 -2.132801 -0.823036
C  0.837341 -0.202762 1.188958
H  0.269512 0.19604 2.028106
H  1.790283 -0.581523 1.572287
H  1.833852 0.492876 -0.603745
C  0.591188 2.078472 0.030431
C  1.002102 2.864943 -1.083027
C  -0.349449 2.615578 0.954511
C  0.498856 4.131092 -1.261795
H  1.716653 2.44923 -1.78532
C  -0.8474 3.879519 0.764066
H  -0.672717 2.027719 1.803816
C  -0.422264 4.631208 -0.339033
H  0.807853 4.735344 -2.105401
H  -1.563589 4.299294 1.459352
H  -0.821149 5.630516 -0.479698
C  1.133863 0.809011 0.168893
H  -1.78398 -4.306484 -1.091108
C  0.74462 -4.997355 -0.384445
H  1.782603 -4.963511 -0.051623
H  0.729495 -5.313837 -1.429871
H  0.224598 -5.761281 0.198381
totalener: -580.78994941130463 hartree
nucrepener: 863.67224738765003 hartree
electener: -1444.46219944701011 hartree
oneelecener: -2479.50218272519260 hartree
twoeener: 1035.03998327818249 hartree
kineticenergy: 578.11881287235587 hartree
exchangeener: -55.484005258371 hartree
correlationener: -4.260576806947 hartree
xcener: -59.744582065318 hartree
energy: -286.3258 -284.9247 -284.9134 -284.8718 -284.8382 -284.2374 -284.2089 -284.1527 -283.5538 -282.9045 -282.8723 -282.7334 -282.6733 -282.5225 -281.9533 -32.3403 -30.9590 -30.1710 -28.9849 -28.7253 -27.6602 -26.9696 -25.6792 -25.1462 -24.7437 -23.6331 -22.9474 -22.2392 -22.1043 -20.9171 -20.3859 -20.2655 -19.7081 -19.3428 -19.3038 -18.6584 -18.5178 -18.2078 -17.6087 -17.4165 -17.2798 -17.2044 -17.1240 -16.7677 -16.1367 -15.8335 -15.3123 -15.1480 -14.7267 -14.3687 -12.6115 -12.2656 -6.0023 -2.6877 -1.9526 -1.6749 -1.4198 -1.2611 -1.1580 -1.0146 -0.6242 -0.5180 -0.4292 electronvolt
chargesum: 1.0000000
charge: -0.081578 0.499479 -0.234152 0.421596 0.210789 -0.371902 -0.221217 -0.044118 0.002436 0.513183 0.108244 0.087928 -0.046201 0.586538 -0.004255 0.022475 -0.173563 -0.048823 -0.330097 -0.073919 0.174878 0.023252 0.011047 0.051265 0.161033 -0.035294 -0.515647 0.073658 0.113792 0.119172
charge: 0.062307 -0.175657 0.079101 -0.158963 0.048245 0.043325 0.020862 0.013813 0.012704 0.037257 0.023275 0.045257 0.054597 -0.144268 0.118529 0.117598 0.072216 0.033138 0.073705 0.021633 0.112837 0.023447 0.023619 0.030673 0.217049 0.023533 0.175621 -0.009407 0.001104 0.002850
qa: -0.0816 0.4995 -0.2342 0.4216 0.2108 -0.3719 -0.2212 -0.0441 0.0024 0.5132 0.1082 0.0879 -0.0462 0.5865 -0.0043 0.0225 -0.1736 -0.0488 -0.3301 -0.0739 0.1749 0.0233 0.0110 0.0513 0.1610 -0.0353 -0.5156 0.0737 0.1138 0.1192
va: 3.3988 2.1702 2.7144 2.4350 3.3641 3.4382 0.9620 0.8750 0.9436 3.0209 0.9032 0.9925 0.9688 1.4952 3.1698 3.2800 3.4239 0.9641 3.4786 0.9500 3.2923 0.9486 0.9630 0.9165 3.0596 0.9777 3.7694 1.0507 1.0424 1.0387
dispersion: -0.067004415 hartree
energy: -580.856953826046 hartree
dipole: 1.476077808 -0.879788378 0.596289430 -6.457742677 8.988577823 2.530835146 -0.043131089 0.028085248 -0.015045841
dipolemethod: SCF
magnitude: 2.600175763 au
magnitude: 6.609121555 debye
