program: Orca
programVersion: 6.1.x
elementType: C C C C C C H H H H C H H H C C C C H C H C H H H C N C C H H H H H H
charge: 1
multiplicity: 1
keywords: wb97x-d3bj def2-tzvppd def2/J tightscf defgrid3
formula: C16H18N
InChI: InChI=1/C16H18N/c1-17(2)16-12-10-15(11-13-16)9-8-14-6-4-3-5-7-14/h3-8,10-13H,9H2,1-2H3
35 atoms
C  -0.093101 -2.938472 0.055247
C  1.244584 -2.722789 -0.35265
C  1.838182 -1.489094 -0.204085
C  1.152232 -0.419629 0.374724
C  -0.179473 -0.611102 0.745288
C  -0.791501 -1.838899 0.607055
H  1.823324 -3.531259 -0.775975
H  2.869904 -1.362728 -0.517382
H  -0.749054 0.209891 1.171496
H  -1.817085 -1.949802 0.928725
C  1.820518 0.932061 0.546167
H  1.695026 1.311286 1.560152
H  2.893978 0.812469 0.370175
H  1.583811 1.628845 -1.490903
C  0.384287 2.892355 -0.28831
C  -0.04732 3.607548 -1.437402
C  -0.097905 3.276845 0.991629
C  -0.917609 4.665318 -1.311867
H  0.321079 3.308089 -2.412661
C  -0.970212 4.331617 1.105397
H  0.219731 2.738711 1.875319
C  -1.375357 5.02186 -0.042673
H  -1.247197 5.21541 -2.184324
H  -1.3437 4.632666 2.076265
H  -2.063077 5.85497 0.057594
C  1.287332 1.845398 -0.465579
N  -0.683098 -4.155152 -0.078059
C  -2.054809 -4.353844 0.358666
C  0.050661 -5.264927 -0.664545
H  -2.332563 -5.39214 0.193692
H  -2.168182 -4.138202 1.425755
H  -2.751085 -3.7221 -0.202657
H  -0.593078 -6.140923 -0.68936
H  0.360651 -5.042346 -1.690425
H  0.939201 -5.513203 -0.075449
totalener: -675.51573156578354 hartree
nucrepener: 1080.88066734276572 hartree
electener: -1756.39640645607051 hartree
oneelecener: -3038.99630352385702 hartree
twoeener: 1282.59989706778651 hartree
kineticenergy: 672.39574893219799 hartree
exchangeener: -64.129755648095 hartree
correlationener: -4.926867426893 hartree
xcener: -69.056623074988 hartree
energy: -395.5341 -285.9310 -284.5392 -284.5102 -284.4953 -284.4781 -283.9137 -283.8854 -283.8013 -283.7606 -283.0657 -282.8256 -282.8064 -282.8056 -282.7286 -282.3246 -282.3223 -32.4757 -31.9845 -30.5809 -29.7085 -28.6262 -28.2813 -27.1299 -26.7117 -25.9146 -25.4909 -24.4561 -24.0825 -23.1536 -22.9605 -21.8803 -21.7782 -20.6860 -20.4348 -20.0128 -19.5538 -19.2190 -18.9795 -18.8726 -18.5887 -18.3928 -18.3059 -17.8333 -17.6268 -17.5247 -16.9735 -16.6954 -16.6787 -16.4791 -16.4413 -16.0729 -15.9138 -15.8953 -14.8531 -14.5051 -14.0263 -13.5721 -12.5817 -10.4815 -5.6767 -2.3842 -1.6214 -1.4754 -1.2288 -1.0589 -0.8949 -0.7774 -0.5066 -0.4075 -0.2333 electronvolt
chargesum: 1.0000000
charge: 1.018237 0.153327 -0.585674 0.293287 -0.147058 -0.257231 -0.056794 -0.155236 -0.101592 -0.091975 0.340700 0.122495 0.097242 -0.050208 0.563152 -0.044430 0.025655 -0.155445 -0.054110 -0.318357 -0.061951 0.146701 0.022434 0.007131 0.046274 0.184831 0.044299 -0.275183 -0.287349 0.046191 0.114427 0.121365 0.052680 0.118961 0.123205
charge: -0.176096 0.083354 0.055241 -0.171860 0.051554 0.080148 -0.003773 0.020624 0.017065 -0.005925 0.016009 0.022207 0.042963 0.051204 -0.147485 0.110960 0.109073 0.066880 0.030916 0.068466 0.018907 0.102103 0.021526 0.021694 0.027893 0.216330 -0.082854 0.154570 0.156010 0.001051 0.009804 0.009944 0.000964 0.009994 0.010538
qa: 1.0182 0.1533 -0.5857 0.2933 -0.1471 -0.2572 -0.0568 -0.1552 -0.1016 -0.0920 0.3407 0.1225 0.0972 -0.0502 0.5632 -0.0444 0.0257 -0.1554 -0.0541 -0.3184 -0.0620 0.1467 0.0224 0.0071 0.0463 0.1848 0.0443 -0.2752 -0.2873 0.0462 0.1144 0.1214 0.0527 0.1190 0.1232
va: 2.2904 2.9721 3.2545 2.2916 3.6252 3.1329 0.9162 0.9887 0.8474 0.9493 3.1421 0.8921 0.9771 0.9604 1.5326 3.2048 3.2913 3.4002 0.9655 3.4740 0.9338 3.3120 0.9470 0.9635 0.9182 3.1198 2.9758 4.0045 4.0030 0.9991 1.0188 1.0196 0.9956 1.0166 1.0158
dispersion: -0.077127682 hartree
energy: -675.592859247430 hartree
dipole: -2.447800793 2.329075731 -0.118725062 -11.466220215 13.790295161 2.324074946 -0.261156260 -0.113459542 -0.374615803
dipolemethod: SCF
magnitude: 2.357065336 au
magnitude: 5.991183956 debye
