program: Orca
programVersion: 6.1.x
elementType: C C C C C C H H C H H H C C C C H C H C H H H C C F F F H C F F F
charge: 1
multiplicity: 1
keywords: wb97x-d3bj def2-tzvppd def2/J tightscf defgrid3
formula: C16H11F6
InChI: InChI=1/C16H11F6/c17-15(18,19)13-8-12(9-14(10-13)16(20,21)22)7-6-11-4-2-1-3-5-11/h1-6,8-10H,7H2
33 atoms
C  -0.686904 -2.34245 -0.09275
C  0.687456 -2.461525 0.079246
C  1.442836 -1.377494 0.490481
C  0.820885 -0.15753 0.746114
C  -0.547905 -0.027728 0.563801
C  -1.296744 -1.122802 0.149176
H  2.511696 -1.489976 0.628262
H  -1.044732 0.919216 0.74706
C  1.646984 1.039561 1.205718
H  1.21187 1.49151 2.095419
H  2.654684 0.694507 1.458103
H  2.327823 1.616989 -0.773778
C  1.203094 3.243514 -0.043798
C  1.415656 3.951109 -1.264925
C  0.423476 3.849052 0.986943
C  0.875862 5.200397 -1.445555
H  2.00764 3.48542 -2.045561
C  -0.111894 5.095203 0.793141
H  0.254338 3.326159 1.919436
C  0.115487 5.764723 -0.418063
H  1.03211 5.743489 -2.369039
H  -0.706569 5.565883 1.565995
H  -0.313189 6.751531 -0.560434
C  1.763667 1.986559 0.081914
C  1.344208 -3.793189 -0.21697
F  2.622996 -3.81794 0.190478
F  1.331955 -4.043793 -1.537408
F  0.696616 -4.796729 0.391358
H  -1.274075 -3.193714 -0.415188
C  -2.794513 -0.968687 0.002637
F  -3.104571 0.238854 -0.51146
F  -3.405008 -1.059245 1.196344
F  -3.317084 -1.902591 -0.798737
totalener: -1215.87076771548618 hartree
nucrepener: 1771.02262606214117 hartree
electener: -2986.89339580280966 hartree
oneelecener: -5168.43876665067091 hartree
twoeener: 2181.54537084786125 hartree
kineticenergy: 1211.27945726054509 hartree
exchangeener: -101.316271683584 hartree
correlationener: -6.936953396732 hartree
xcener: -108.253225080316 hartree
energy: -677.4802 -677.4580 -677.3966 -677.3607 -677.2787 -677.2560 -289.3581 -289.2502 -286.6989 -285.3029 -285.3009 -285.2504 -285.2306 -284.6926 -284.5703 -284.5342 -284.3643 -283.9281 -283.8875 -283.8856 -283.7937 -283.6935 -42.2053 -42.0918 -39.7711 -39.6625 -39.6558 -39.5443 -32.7116 -31.7706 -30.8757 -29.4436 -29.2798 -28.9400 -27.8402 -26.2372 -25.8925 -25.8289 -25.0989 -24.1449 -23.9076 -23.6123 -22.5184 -22.4819 -22.2617 -22.1588 -22.0326 -21.8705 -21.3649 -20.9129 -20.7429 -20.6098 -20.1702 -19.7811 -19.6591 -19.2265 -18.9746 -18.7703 -18.6938 -18.6447 -18.5330 -18.3633 -18.0155 -17.8654 -17.6717 -17.6293 -17.5996 -17.5583 -17.3228 -17.2496 -17.1637 -17.0685 -16.9506 -16.8679 -16.2361 -15.8165 -15.2010 -14.7168 -13.6152 -13.4847 -6.4017 -3.0033 -2.5462 -2.4595 -1.9314 -1.8801 -1.5063 -1.3080 -0.8339 -0.7265 -0.6984 electronvolt
chargesum: 1.0000000
charge: -0.657722 0.546268 -0.564465 0.709990 -0.196541 0.263923 -0.108940 -0.120627 0.487847 0.124768 0.105735 -0.036680 0.616368 -0.026268 0.066031 -0.171629 -0.049796 -0.358116 -0.073040 0.180414 0.026401 0.014822 0.053527 0.155477 0.721280 -0.238050 -0.211679 -0.221906 -0.108335 0.739069 -0.236383 -0.207216 -0.224525
charge: 0.149993 -0.043761 0.125530 -0.125203 0.118990 -0.045858 0.031754 0.034416 0.050124 0.024855 0.048381 0.054884 -0.141543 0.124596 0.122311 0.077298 0.034807 0.078585 0.022672 0.123111 0.025457 0.025630 0.033242 0.217024 -0.577271 0.149424 0.160589 0.164180 0.045006 -0.575663 0.142386 0.161003 0.163050
qa: -0.6577 0.5463 -0.5645 0.7100 -0.1965 0.2639 -0.1089 -0.1206 0.4878 0.1248 0.1057 -0.0367 0.6164 -0.0263 0.0660 -0.1716 -0.0498 -0.3581 -0.0730 0.1804 0.0264 0.0148 0.0535 0.1555 0.7213 -0.2381 -0.2117 -0.2219 -0.1083 0.7391 -0.2364 -0.2072 -0.2245
va: 3.0663 2.6749 2.4089 1.9503 3.2490 2.4629 0.9560 0.9047 3.0309 0.8946 0.9798 0.9642 1.5383 3.1802 3.2483 3.4183 0.9679 3.4649 0.9310 3.2900 0.9488 0.9620 0.9176 3.0790 3.2242 0.9828 1.0131 1.0181 1.0387 3.2865 0.9916 1.0022 1.0033
dispersion: -0.075759037 hartree
energy: -1215.946526752188 hartree
dipole: 13.129539509 -10.889506332 2.240033177 38.408152049 -31.898019924 6.510132125 3.081388927 -2.892283931 0.189104996
dipolemethod: SCF
magnitude: 6.887331095 au
magnitude: 17.506204403 debye
