program: Orca
programVersion: 6.1.x
elementType: C C C C C C H H H H C H H H C C C C H C H C H H H C C C H H H
charge: 1
multiplicity: 1
keywords: wb97x-d3bj def2-tzvppd def2/J tightscf defgrid3
formula: C16H15
InChI: InChI=1/C16H15/c1-2-14-8-10-16(11-9-14)13-12-15-6-4-3-5-7-15/h2-12H,1,13H2
31 atoms
C  -0.18255 -3.398465 -0.040663
C  1.097332 -3.188398 -0.558257
C  1.722404 -1.958016 -0.441585
C  1.078987 -0.908348 0.205949
C  -0.212075 -1.093718 0.696427
C  -0.831409 -2.326103 0.579106
H  1.613964 -4.007033 -1.047359
H  2.723905 -1.823067 -0.837069
H  -0.736326 -0.275276 1.181129
H  -1.837672 -2.452295 0.959606
C  1.76518 0.44611 0.340088
H  1.728914 0.804011 1.367998
H  2.816838 0.330281 0.058731
H  1.308175 1.141803 -1.659714
C  0.33127 2.469327 -0.339244
C  -0.199738 3.196647 -1.442032
C  0.018803 2.885563 0.986018
C  -1.002081 4.29192 -1.229538
H  0.039328 2.872939 -2.44933
C  -0.785979 3.978308 1.185896
H  0.414137 2.340885 1.833613
C  -1.291084 4.67653 0.081292
H  -1.407918 4.850697 -2.0634
H  -1.031091 4.305052 2.188751
H  -1.92525 5.540648 0.250503
C  1.145206 1.378195 -0.608796
C  -0.802008 -4.732026 -0.167398
C  -1.821963 -5.179398 0.556415
H  -0.347255 -5.388201 -0.904567
H  -2.213166 -6.17825 0.405647
H  -2.292435 -4.582794 1.330533
totalener: -618.89485762221102 hartree
nucrepener: 934.16018027742177 hartree
electener: -1553.05504404590079 hartree
oneelecener: -2670.52067044863179 hartree
twoeener: 1117.46562640273100 hartree
kineticenergy: 616.07864286544952 hartree
exchangeener: -59.010613697719 hartree
correlationener: -4.511342800073 hartree
xcener: -63.521956497793 hartree
energy: -286.3204 -284.9216 -284.9093 -284.8700 -284.8385 -284.2378 -284.2068 -284.1647 -283.5536 -282.9860 -282.9521 -282.8940 -282.6773 -282.6410 -282.2041 -281.9376 -32.3385 -30.9850 -30.2240 -28.9988 -28.8418 -27.7464 -27.2414 -26.4296 -25.5146 -24.7430 -23.6761 -23.3975 -22.8140 -22.1189 -21.4747 -20.9522 -20.3897 -20.1745 -19.7203 -19.3181 -19.1416 -18.8924 -18.5096 -18.3409 -17.9497 -17.6731 -17.4986 -17.1884 -16.9939 -16.8182 -16.4326 -15.9893 -15.3030 -14.9256 -14.7745 -14.3671 -13.8522 -12.7208 -11.5686 -6.0105 -2.6879 -2.1329 -1.6740 -1.5862 -1.4503 -1.2528 -1.0386 -0.6503 -0.5108 -0.4099 electronvolt
chargesum: 1.0000000
charge: 0.651675 -0.109357 -0.147007 0.505304 0.147839 -0.346267 -0.078036 -0.108016 -0.056976 -0.125114 0.318825 0.117789 0.085905 -0.035668 0.590118 -0.012185 0.034891 -0.171116 -0.049568 -0.324058 -0.067413 0.174003 0.024209 0.009676 0.051689 0.162033 -0.154063 -0.099210 -0.023215 0.045673 -0.012360
charge: -0.160390 0.070363 0.062187 -0.163637 0.061112 0.072318 0.020484 0.019130 0.016877 0.011815 0.034052 0.022851 0.045582 0.054019 -0.143820 0.118346 0.117103 0.072148 0.033098 0.073423 0.021214 0.112535 0.023459 0.023537 0.030607 0.217864 -0.017587 0.206217 0.006355 -0.027968 -0.033293
qa: 0.6517 -0.1094 -0.1470 0.5053 0.1478 -0.3463 -0.0780 -0.1080 -0.0570 -0.1251 0.3188 0.1178 0.0859 -0.0357 0.5901 -0.0122 0.0349 -0.1711 -0.0496 -0.3241 -0.0674 0.1740 0.0242 0.0097 0.0517 0.1620 -0.1541 -0.0992 -0.0232 0.0457 -0.0124
va: 1.5038 3.0946 3.2037 2.2711 3.3149 3.2288 0.9643 0.9679 0.8561 0.9610 3.2706 0.8956 0.9911 0.9600 1.5725 3.1717 3.2754 3.4173 0.9657 3.4792 0.9434 3.2878 0.9485 0.9641 0.9165 3.1302 3.2405 3.7711 0.9669 1.0101 0.9800
dispersion: -0.070943570 hartree
energy: -618.965801192082 hartree
dipole: -1.021304383 1.188872397 0.167568013 -2.631067046 5.837056465 3.205989420 0.695034017 -1.022860854 -0.327826837
dipolemethod: SCF
magnitude: 3.227060215 au
magnitude: 8.202535201 debye
