program: Orca
programVersion: 6.1.x
elementType: C C C C C C H H H H C H H H C C C C H C H C H H H C C C H
charge: 1
multiplicity: 1
keywords: wb97x-d3bj def2-tzvppd def2/J tightscf defgrid3
formula: C16H13
InChI: InChI=1/C16H13/c1-2-14-8-10-16(11-9-14)13-12-15-6-4-3-5-7-15/h1,3-12H,13H2
29 atoms
C  -0.284352 -3.480251 0.108749
C  0.96145 -3.318986 -0.50235
C  1.606025 -2.094912 -0.456844
C  1.023914 -1.020784 0.210614
C  -0.225375 -1.171626 0.806452
C  -0.872627 -2.395648 0.764586
H  1.420151 -4.161155 -1.005636
H  2.578193 -1.983528 -0.925486
H  -0.692126 -0.337526 1.321638
H  -1.837843 -2.522094 1.239254
C  1.739405 0.324298 0.266324
H  1.787501 0.700066 1.287166
H  2.76459 0.187794 -0.09338
H  1.124318 0.981367 -1.70484
C  0.31175 2.374821 -0.343095
C  -0.293797 3.089479 -1.416427
C  0.132688 2.838086 0.992112
C  -1.039599 4.216005 -1.16666
H  -0.156308 2.730418 -2.430721
C  -0.615998 3.962316 1.22919
H  0.58561 2.304363 1.817586
C  -1.196932 4.646002 0.152693
H  -1.501728 4.764912 -1.977453
H  -0.759532 4.325103 2.2393
H  -1.786331 5.535225 0.351354
C  1.062415 1.250732 -0.650993
C  -0.954718 -4.749266 0.064615
C  -1.514274 -5.808019 0.02626
H  -2.010033 -6.752126 -0.005807
totalener: -617.63175653915243 hartree
nucrepener: 904.04610975378660 hartree
electener: -1521.67786569470672 hartree
oneelecener: -2608.95707846462892 hartree
twoeener: 1087.27921276992220 hartree
kineticenergy: 614.86424682828567 hartree
exchangeener: -58.656336368750 hartree
correlationener: -4.441555281342 hartree
xcener: -63.097891650091 hartree
energy: -286.4111 -285.0126 -285.0039 -284.9611 -284.9311 -284.3172 -284.2852 -284.2810 -283.7359 -283.4709 -283.1334 -283.0444 -282.9161 -282.8844 -282.0871 -281.9488 -32.4259 -31.1259 -30.3716 -29.0886 -28.9355 -27.6476 -27.4217 -26.3545 -25.6304 -24.8328 -23.7938 -23.4822 -23.0232 -22.2063 -21.2905 -21.0321 -20.4626 -19.8934 -19.8326 -19.4105 -19.3646 -19.0009 -18.6585 -18.4308 -17.9335 -17.8635 -17.5768 -17.2744 -16.9385 -16.6767 -16.1214 -15.5915 -14.9214 -14.4518 -14.2164 -13.0119 -12.8844 -11.8270 -6.1025 -2.7632 -2.2364 -1.7382 -1.7102 -1.4956 -1.3043 -1.1006 -0.7023 -0.5548 -0.4738 electronvolt
chargesum: 1.0000000
charge: 0.229719 -0.281859 -0.060427 0.438359 0.457616 -0.605604 -0.041031 -0.100022 -0.034092 -0.053228 0.357863 0.116862 0.084891 -0.038461 0.592457 0.005950 0.027744 -0.179783 -0.047710 -0.325381 -0.070967 0.183300 0.023968 0.011199 0.053098 0.155948 -0.125097 0.162884 0.061807
charge: -0.193751 0.079357 0.065037 -0.160991 0.061849 0.076503 0.026194 0.019970 0.017917 0.024509 0.036996 0.022990 0.046466 0.054326 -0.143153 0.119855 0.118751 0.073323 0.033555 0.074518 0.021561 0.114974 0.023934 0.024006 0.031232 0.217485 -0.061019 0.242193 -0.068588
qa: 0.2297 -0.2819 -0.0604 0.4384 0.4576 -0.6056 -0.0410 -0.1000 -0.0341 -0.0532 0.3579 0.1169 0.0849 -0.0385 0.5925 0.0060 0.0277 -0.1798 -0.0477 -0.3254 -0.0710 0.1833 0.0240 0.0112 0.0531 0.1559 -0.1251 0.1629 0.0618
va: 1.3158 3.1995 3.1616 2.4100 2.8895 2.8945 0.9963 0.9588 0.8416 1.0061 3.2422 0.8924 0.9892 0.9646 1.5546 3.1659 3.2783 3.4281 0.9656 3.4799 0.9476 3.2808 0.9496 0.9637 0.9155 3.1274 3.1864 3.8228 1.0257
dispersion: -0.067921186 hartree
energy: -617.699677725323 hartree
dipole: 1.446087300 -1.193484337 0.252602963 6.024832665 -2.545406086 3.479426579 0.038407286 -0.400043814 -0.361636528
dipolemethod: SCF
magnitude: 3.507277941 au
magnitude: 8.914792055 debye
