program: Orca
programVersion: 6.1.x
elementType: C C C C C C H H H H C H H H C C C C H C H C H H H C C H H H
charge: 1
multiplicity: 1
keywords: wb97x-d3bj def2-tzvppd def2/J tightscf defgrid3
formula: C15H15
InChI: InChI=1/C15H15/c1-13-7-9-15(10-8-13)12-11-14-5-3-2-4-6-14/h2-10,12H,11H2,1H3
30 atoms
C  -0.340822 -3.783708 0.082064
C  0.268398 -3.285635 1.246011
C  0.783522 -2.017147 1.263347
C  0.71271 -1.186454 0.105489
C  0.089211 -1.705918 -1.069693
C  -0.422173 -2.971502 -1.070747
H  0.323804 -3.912199 2.128039
H  1.252343 -1.626011 2.160103
H  0.019404 -1.094888 -1.960454
H  -0.897893 -3.367513 -1.960579
C  1.25271 0.08128 0.173573
H  1.69228 0.373565 1.126408
H  2.285961 1.500017 -0.954148
H  0.944338 0.76143 -1.835281
C  0.369681 2.276105 -0.393174
C  -1.01383 2.123385 -0.383458
C  0.939521 3.468187 0.043522
C  -1.823688 3.170716 0.034786
H  -1.463959 1.192687 -0.716281
C  0.128429 4.513167 0.462577
H  2.017873 3.589556 0.037211
C  -1.252819 4.365218 0.458001
H  -2.901253 3.054915 0.02947
H  0.575503 5.44563 0.786752
H  -1.886495 5.182303 0.782607
C  1.26007 1.129649 -0.860278
C  -0.889375 -5.171732 0.043652
H  -1.876549 -5.182625 -0.423415
H  -0.235154 -5.796513 -0.573913
H  -0.951133 -5.614087 1.036805
totalener: -580.79701813984536 hartree
nucrepener: 861.56267486096567 hartree
electener: -1442.35969111732152 hartree
oneelecener: -2475.17942914643299 hartree
twoeener: 1032.81973802911148 hartree
kineticenergy: 578.12485177410667 hartree
exchangeener: -55.485321258407 hartree
correlationener: -4.260743523532 hartree
xcener: -59.746064781939 hartree
energy: -286.0200 -285.2211 -284.8381 -284.7558 -284.6654 -284.0902 -284.0514 -284.0187 -283.4543 -283.2946 -282.8693 -282.7815 -282.6373 -282.5979 -282.5635 -32.2569 -30.9054 -30.1776 -28.9475 -28.8325 -27.4799 -27.1258 -26.2816 -25.0161 -24.5507 -23.4581 -23.1311 -22.5330 -21.6541 -20.8377 -20.4281 -20.1584 -19.4733 -19.2705 -19.0408 -18.7886 -18.6358 -18.4071 -17.8863 -17.5917 -17.3887 -17.2678 -17.1624 -16.9424 -16.5437 -16.2094 -15.4134 -15.2488 -14.3381 -14.3205 -12.6062 -12.5223 -5.7908 -2.6104 -1.8393 -1.6250 -1.4162 -1.2461 -1.1272 -0.9851 -0.6196 -0.5082 -0.3746 electronvolt
chargesum: 1.0000000
charge: 0.733633 -0.008606 -0.082226 0.517997 -0.128964 -0.275064 -0.074979 -0.059663 -0.091557 -0.072682 0.155018 -0.048849 0.084229 0.119102 0.316083 0.190690 -0.284800 -0.242699 -0.034271 -0.029248 -0.092360 -0.038992 0.009229 0.013812 0.027733 0.564007 -0.526001 0.119751 0.150412 0.089266
charge: -0.111599 0.091266 0.125488 -0.145440 0.122894 0.090234 0.027761 0.034485 0.022178 0.031683 0.203927 0.052462 0.043939 0.021552 -0.167306 0.049118 0.052478 0.036305 0.015311 0.039146 0.017014 0.036269 0.011406 0.013201 0.012568 0.035887 0.200756 0.012561 0.021913 0.002544
qa: 0.7336 -0.0086 -0.0822 0.5180 -0.1290 -0.2751 -0.0750 -0.0597 -0.0916 -0.0727 0.1550 -0.0488 0.0842 0.1191 0.3161 0.1907 -0.2848 -0.2427 -0.0343 -0.0292 -0.0924 -0.0390 0.0092 0.0138 0.0277 0.5640 -0.5260 0.1198 0.1504 0.0893
va: 2.2093 3.1543 3.0316 1.2503 3.2771 3.2842 0.9793 0.9628 0.9310 1.0086 3.0555 0.9617 0.9900 0.8965 2.3351 3.2780 3.3972 3.3908 0.8735 3.3875 0.9684 3.3623 0.9390 0.9380 0.9277 2.9701 3.8191 1.0383 1.0248 1.0452
dispersion: -0.066944786 hartree
energy: -580.863962926328 hartree
dipole: -1.006166452 1.529684240 0.523517788 -5.625429845 3.465680886 -2.159748959 -0.408832959 0.510725725 0.101892766
dipolemethod: SCF
magnitude: 2.224627739 au
magnitude: 5.654554337 debye
