program: Orca
programVersion: 6.1.x
elementType: C C C C C C H H H H C H H H C C C C H C H C H H H C C C C H H H H H
charge: 1
multiplicity: 1
keywords: wb97x-d3bj def2-tzvppd def2/J tightscf defgrid3
formula: C17H17
InChI: InChI=1/C17H17/c1-2-4-14(5-3-1)6-7-15-8-10-16(11-9-15)17-12-13-17/h1-5,7-11,17H,6,12-13H2
34 atoms
C  -0.038353 -3.072717 -0.266058
C  0.292568 -2.612381 1.030221
C  0.714666 -1.330439 1.21643
C  0.836836 -0.423768 0.11502
C  0.49775 -0.901738 -1.19019
C  0.074374 -2.184102 -1.365269
H  0.209552 -3.27922 1.878878
H  0.966352 -0.976414 2.210545
H  0.576384 -0.241014 -2.044026
H  -0.181968 -2.543993 -2.354517
C  1.271723 0.856308 0.358828
H  1.487831 1.110275 1.395596
H  2.428715 2.392116 -0.4627
H  1.338137 1.64688 -1.634518
C  0.395236 3.039984 -0.268063
C  -0.949906 2.82166 -0.551463
C  0.790745 4.230212 0.334373
C  -1.8895 3.800259 -0.256699
H  -1.26633 1.892135 -1.015746
C  -0.149778 5.207046 0.630296
H  1.838748 4.40412 0.556159
C  -1.489751 4.993212 0.334252
H  -2.934611 3.632661 -0.489836
H  0.165675 6.138201 1.086375
H  -2.224123 5.757042 0.561998
C  1.428378 1.969439 -0.598185
C  -0.49241 -4.433553 -0.508804
C  0.059522 -5.581561 0.336085
C  -1.337797 -5.153637 0.541251
H  -0.715092 -4.665017 -1.542195
H  0.801989 -5.326688 1.08156
H  0.249981 -6.500334 -0.202971
H  -2.135028 -5.770054 0.14692
H  -1.591212 -4.594916 1.433241
totalener: -658.25037733208922 hartree
nucrepener: 1043.06297568729337 hartree
electener: -1701.31335021536211 hartree
oneelecener: -2939.21352052483053 hartree
twoeener: 1237.90017030946842 hartree
kineticenergy: 655.20340422615891 hartree
exchangeener: -62.910793473149 hartree
correlationener: -4.841993319244 hartree
xcener: -67.752786792393 hartree
energy: -285.6179 -285.1698 -284.6168 -284.5753 -284.4172 -283.9288 -283.9283 -283.7848 -283.7479 -283.3767 -283.3685 -283.2488 -282.6930 -282.6110 -282.4857 -282.4445 -282.4074 -32.1561 -31.2304 -30.5200 -29.7520 -28.7559 -28.3498 -26.9629 -26.8194 -25.6777 -24.5346 -23.8071 -23.4779 -23.0514 -22.9476 -22.3658 -21.4308 -21.1104 -20.3142 -20.0359 -19.7562 -19.5223 -19.0411 -18.9616 -18.5300 -18.2125 -18.0907 -17.9452 -17.4704 -17.3543 -16.8993 -16.8446 -16.4921 -16.4109 -16.0543 -15.7490 -15.1579 -15.0846 -14.9416 -14.2166 -13.4166 -12.4469 -12.3345 -5.5517 -2.3814 -1.7121 -1.4959 -1.2715 -1.1547 -0.9720 -0.8557 -0.6199 -0.5225 -0.4400 electronvolt
chargesum: 1.0000000
charge: 0.857524 0.079356 -0.558522 0.578810 -0.003897 -0.537437 -0.072456 -0.108343 -0.102133 -0.111600 0.148926 -0.051119 0.081620 0.128180 0.265528 0.211043 -0.302465 -0.248024 -0.028816 -0.028160 -0.092897 -0.036419 0.007750 0.013058 0.027032 0.552381 0.275000 -0.039436 -0.038815 0.000422 0.016810 0.049962 0.049206 0.017929
charge: -0.060499 0.094889 0.123489 -0.147947 0.122582 0.102437 0.019437 0.034199 0.022193 0.027554 0.190380 0.049976 0.041614 0.020223 -0.168687 0.047929 0.051253 0.034199 0.014952 0.036896 0.016363 0.033394 0.010519 0.012331 0.011579 0.034134 -0.089564 0.104241 0.103809 0.038862 0.012775 0.020935 0.020838 0.012714
qa: 0.8575 0.0794 -0.5585 0.5788 -0.0039 -0.5374 -0.0725 -0.1083 -0.1021 -0.1116 0.1489 -0.0511 0.0816 0.1282 0.2655 0.2110 -0.3025 -0.2480 -0.0288 -0.0282 -0.0929 -0.0364 0.0077 0.0131 0.0270 0.5524 0.2750 -0.0394 -0.0388 0.0004 0.0168 0.0500 0.0492 0.0179
va: 1.3272 2.9851 2.9896 1.1317 3.1441 3.2066 0.9346 0.9861 0.9290 1.0075 3.0889 0.9494 0.9863 0.8938 2.3219 3.2605 3.3857 3.3826 0.8715 3.3734 0.9710 3.3536 0.9377 0.9374 0.9273 2.9918 2.7701 4.0046 4.0015 0.8825 1.0125 1.0305 1.0308 1.0118
dispersion: -0.076314187 hartree
energy: -658.326691518770 hartree
dipole: -0.864934017 1.421945088 0.557011071 -7.052783416 5.311265115 -1.741518301 0.616900636 -0.497162236 0.119738401
dipolemethod: SCF
magnitude: 1.832344021 au
magnitude: 4.657448368 debye
