program: Orca
programVersion: 6.1.x
elementType: C C C C C C H H H H C H H H C C C C H C H C H H H C O H
charge: 1
multiplicity: 1
keywords: wb97x-d3bj def2-tzvppd def2/J tightscf defgrid3
formula: C14H13O
InChI: InChI=1/C14H13O/c15-14-10-8-13(9-11-14)7-6-12-4-2-1-3-5-12/h1-5,7-11,15H,6H2
28 atoms
C  -0.332609 -3.809375 0.060304
C  0.320555 -3.332863 1.219397
C  0.826497 -2.071839 1.213916
C  0.712402 -1.224901 0.060547
C  0.041318 -1.74262 -1.095171
C  -0.469394 -3.002043 -1.097281
H  0.397856 -3.986855 2.078582
H  1.330137 -1.685059 2.093282
H  -0.062913 -1.125388 -1.97815
H  -0.977893 -3.397928 -1.969832
C  1.248346 0.036757 0.11078
H  1.725565 0.327555 1.045453
H  2.237516 1.45318 -1.0662
H  0.847659 0.732777 -1.881094
C  0.357727 2.243746 -0.406391
C  -1.024476 2.101498 -0.323905
C  0.955897 3.432607 -0.000688
C  -1.804797 3.152461 0.138576
H  -1.49792 1.174159 -0.633398
C  0.174928 4.482057 0.463264
H  2.03312 3.547757 -0.064482
C  -1.205231 4.34312 0.532259
H  -2.881862 3.043163 0.190367
H  0.644783 5.41096 0.76475
H  -1.815661 5.163495 0.891292
C  1.214229 1.09329 -0.920772
O  -0.805286 -5.037732 0.116085
H  -1.238202 -5.300816 -0.708492
totalener: -616.71968094260285 hartree
nucrepener: 865.16794177033648 hartree
electener: -1481.88762054513427 hartree
oneelecener: -2533.25848383610355 hartree
twoeener: 1051.37086329096928 hartree
kineticenergy: 613.99766649149933 hartree
exchangeener: -57.418119627752 hartree
correlationener: -4.310026044850 hartree
xcener: -61.728145672602 hartree
energy: -528.9181 -287.0382 -285.7525 -285.0313 -284.9282 -284.6645 -284.4529 -284.1956 -283.9206 -283.3421 -282.7918 -282.6983 -282.5726 -282.5266 -282.4892 -38.0159 -32.2496 -30.7456 -29.9542 -29.2234 -28.4597 -27.0516 -26.8132 -25.6293 -25.4043 -23.6816 -23.1980 -23.0547 -22.4631 -21.8242 -20.7822 -20.3996 -19.9060 -19.6853 -19.5406 -19.4681 -18.8486 -18.5194 -18.2934 -17.9428 -17.8130 -17.5154 -17.1825 -17.0361 -16.7236 -16.1547 -15.3281 -15.1751 -14.6680 -14.0102 -12.5348 -12.4378 -5.5732 -2.7411 -1.8390 -1.7591 -1.5000 -1.3772 -1.1543 -1.0196 -0.7862 -0.5928 -0.4607 electronvolt
chargesum: 1.0000000
charge: 0.844585 -0.172587 -0.015275 0.339807 -0.142357 -0.154406 0.004026 -0.050986 -0.081653 -0.141349 0.125488 -0.050866 0.079552 0.115515 0.301251 0.200876 -0.278807 -0.250677 -0.039074 -0.034235 -0.092434 -0.039526 0.008749 0.014031 0.026835 0.581723 -0.286706 0.188500
charge: -0.183079 0.121943 0.123545 -0.146195 0.123772 0.115484 0.037278 0.037209 0.025324 0.031537 0.187127 0.050746 0.042077 0.020035 -0.169787 0.046855 0.051706 0.034608 0.014463 0.037949 0.016598 0.034434 0.010780 0.012743 0.012009 0.034162 0.379598 -0.102923
qa: 0.8446 -0.1726 -0.0153 0.3398 -0.1424 -0.1544 0.0040 -0.0510 -0.0817 -0.1413 0.1255 -0.0509 0.0796 0.1155 0.3013 0.2009 -0.2788 -0.2507 -0.0391 -0.0342 -0.0924 -0.0395 0.0087 0.0140 0.0268 0.5817 -0.2867 0.1885
va: 2.7520 3.4227 3.0891 1.4386 3.6948 3.4864 0.9830 0.9503 0.9279 0.9661 3.0782 0.9653 0.9955 0.8944 2.3168 3.2666 3.4040 3.3976 0.8729 3.3859 0.9695 3.3617 0.9382 0.9374 0.9280 2.9455 2.1174 1.0075
dispersion: -0.063528247 hartree
energy: -616.783209189611 hartree
dipole: 0.680661900 -0.369232017 0.311429883 5.366894738 -7.601579470 -2.234684731 -1.163815623 0.736166086 -0.427649537
dipolemethod: SCF
magnitude: 2.296451294 au
magnitude: 5.837115307 debye
