program: Orca
programVersion: 6.1.x
elementType: C C C C C C H H H H C H H H C C C C H C H C H H H C C C H
charge: 1
multiplicity: 1
keywords: wb97x-d3bj def2-tzvppd def2/J tightscf defgrid3
formula: C16H13
InChI: InChI=1/C16H13/c1-2-14-8-10-16(11-9-14)13-12-15-6-4-3-5-7-15/h1,3-11,13H,12H2
29 atoms
C  -0.090397 -3.541361 0.033153
C  0.439617 -3.035237 1.236311
C  0.888563 -1.744041 1.280517
C  0.828628 -0.909409 0.124411
C  0.287437 -1.444395 -1.082891
C  -0.162431 -2.733095 -1.124068
H  0.482247 -3.675212 2.108029
H  1.297111 -1.338011 2.199582
H  0.230866 -0.828536 -1.971037
H  -0.575284 -3.152408 -2.032529
C  1.301544 0.384978 0.225008
H  1.681894 0.690024 1.199054
H  2.30777 1.869179 -0.839844
H  1.054393 1.066608 -1.791623
C  0.326679 2.53275 -0.368267
C  -1.044979 2.301726 -0.421624
C  0.808247 3.751891 0.09914
C  -1.930797 3.299116 -0.036627
H  -1.426428 1.349359 -0.778058
C  -0.0788 4.746656 0.4847
H  1.877179 3.933663 0.142596
C  -1.447943 4.521002 0.416802
H  -2.998718 3.122769 -0.091148
H  0.29959 5.700755 0.832473
H  -2.140811 5.298911 0.715673
C  1.300927 1.441221 -0.799262
C  -0.559921 -4.882463 -0.020051
C  -0.956269 -6.013675 -0.065327
H  -1.308904 -7.021751 -0.105248
totalener: -617.63485917323283 hartree
nucrepener: 903.90373951537674 hartree
electener: -1521.53859886738064 hartree
oneelecener: -2608.56819684712764 hartree
twoeener: 1087.02959797974700 hartree
kineticenergy: 614.86948833710994 hartree
exchangeener: -58.656650628584 hartree
correlationener: -4.441616325774 hartree
xcener: -63.098266954357 hartree
energy: -286.0920 -285.6754 -284.8911 -284.8480 -284.7728 -284.2959 -284.2586 -284.0661 -283.7260 -283.5246 -283.4985 -282.9056 -282.8149 -282.6659 -282.6281 -282.5949 -32.3980 -31.0108 -30.2828 -29.0934 -28.9901 -27.9438 -27.1591 -26.8404 -25.7405 -24.8608 -23.7257 -23.1659 -22.7437 -22.5683 -21.4480 -20.8983 -20.5665 -20.4172 -19.6970 -19.3493 -19.2816 -18.7405 -18.4996 -18.3944 -17.9007 -17.6852 -17.5587 -17.1467 -16.8387 -16.2862 -16.0404 -15.3542 -15.2791 -14.4978 -14.4397 -13.6502 -12.6367 -12.5402 -6.0831 -2.6628 -2.3433 -1.6377 -1.4630 -1.2609 -1.1445 -0.9690 -0.6396 -0.4897 -0.4275 electronvolt
chargesum: 1.0000000
charge: 0.481085 -0.325150 0.064290 0.550091 0.101956 -0.432526 -0.020181 -0.046005 -0.068519 -0.037541 0.094262 -0.047464 0.084591 0.114678 0.333109 0.186840 -0.290713 -0.241962 -0.030618 -0.029738 -0.092225 -0.042305 0.009911 0.014678 0.027553 0.552324 -0.167797 0.191923 0.065453
charge: -0.134350 0.099518 0.125829 -0.141950 0.125850 0.101230 0.033428 0.034951 0.023011 0.033432 0.206027 0.052751 0.044327 0.021872 -0.166500 0.049591 0.052928 0.036991 0.015384 0.039755 0.017176 0.037110 0.011697 0.013430 0.012826 0.035755 -0.030300 0.296617 -0.048387
qa: 0.4811 -0.3251 0.0643 0.5501 0.1020 -0.4325 -0.0202 -0.0460 -0.0685 -0.0375 0.0943 -0.0475 0.0846 0.1147 0.3331 0.1868 -0.2907 -0.2420 -0.0306 -0.0297 -0.0922 -0.0423 0.0099 0.0147 0.0276 0.5523 -0.1678 0.1919 0.0655
va: 1.4590 3.1923 2.9661 1.4391 3.0631 3.1150 0.9982 0.9504 0.9116 1.0088 3.1228 0.9613 0.9888 0.9043 2.3162 3.2729 3.3907 3.3899 0.8701 3.3809 0.9708 3.3629 0.9378 0.9373 0.9278 2.9947 3.2457 3.7452 1.0196
dispersion: -0.067981388 hartree
energy: -617.702840560917 hartree
dipole: 0.750010678 -0.100420987 0.649589691 7.106555736 -8.734936859 -1.628381123 -0.349027503 0.484097003 0.135069501
dipolemethod: SCF
magnitude: 1.758361629 au
magnitude: 4.469400072 debye
