program: Orca
programVersion: 6.1.x
elementType: C C C C C C H H H C H H H C C C C H C H C H H H C H C H H H
charge: 1
multiplicity: 1
keywords: optts freq wb97x-d3bj def2-tzvp(-f) def2/J tightscf tightopt
frequency: 0.00 0.00 0.00 0.00 0.00 0.00 -703.87 31.36 37.04 54.40 56.18 131.54 179.30 213.37 233.18 240.83 320.10 369.02 411.97 436.38 467.43 499.68 529.33 556.92 562.47 634.06 660.71 701.85 707.69 775.02 785.34 812.64 868.07 878.00 908.58 947.99 955.84 968.44 994.18 1010.21 1023.17 1028.02 1032.32 1034.40 1042.85 1065.84 1079.35 1099.07 1129.06 1143.50 1194.76 1201.84 1213.10 1216.61 1222.74 1245.35 1273.52 1327.51 1333.52 1339.90 1361.65 1365.64 1380.35 1435.28 1472.14 1494.97 1507.75 1516.55 1550.72 1556.53 1603.37 1664.71 1666.99 1680.99 1687.93 2120.36 3076.45 3144.89 3162.90 3186.40 3194.86 3197.40 3206.95 3207.36 3215.47 3217.97 3222.53 3235.26 3235.75 3241.58
frequency: 31.36 37.04 54.40 56.18 131.54 179.30 213.37 233.18 240.83 320.10 369.02 411.97 436.38 467.43 499.68 529.33 556.92 562.47 634.06 660.71 701.85 707.69 775.02 785.34 812.64 868.07 878.00 908.58 947.99 955.84 968.44 994.18 1010.21 1023.17 1028.02 1032.32 1034.40 1042.85 1065.84 1079.35 1099.07 1129.06 1143.50 1194.76 1201.84 1213.10 1216.61 1222.74 1245.35 1273.52 1327.51 1333.52 1339.90 1361.65 1365.64 1380.35 1435.28 1472.14 1494.97 1507.75 1516.55 1550.72 1556.53 1603.37 1664.71 1666.99 1680.99 1687.93 2120.36 3076.45 3144.89 3162.90 3186.40 3194.86 3197.40 3206.95 3207.36 3215.47 3217.97 3222.53 3235.26 3235.75 3241.58
formula: C15H15
InChI: InChI=1/C15H15/c1-11-6-5-9-13(10-11)15-14(16-15)12-7-3-2-4-8-12/h2-10,14-15H,1H3
30 atoms
C  -0.721603 -4.216538 0.250887
C  0.576246 -3.860043 -0.122624
C  0.876485 -2.508217 -0.209294
C  -0.09261 -1.534485 0.059972
C  -1.380915 -1.912922 0.444552
C  -1.687686 -3.259515 0.536527
H  1.878573 -2.201346 -0.49431
H  -2.131022 -1.173798 0.701002
H  -2.679748 -3.56815 0.843629
C  0.301937 -0.133148 -0.058808
H  1.36757 0.083793 -0.032448
H  -0.058118 0.372982 -1.209551
H  -1.625073 0.747599 -0.232786
C  -0.186109 2.375743 -0.066684
C  -1.121936 3.325859 -0.489631
C  1.057926 2.789944 0.424678
C  -0.810211 4.674095 -0.443766
H  -2.091057 3.00423 -0.857106
C  1.362331 4.137586 0.470896
H  1.776903 2.069276 0.797249
C  0.431728 5.07714 0.032562
H  -1.533562 5.409682 -0.773741
H  2.319911 4.462418 0.859426
H  0.675011 6.132646 0.074734
C  -0.564089 0.969001 -0.139088
H  -0.976694 -5.268357 0.33144
C  1.60856 -4.916643 -0.412416
H  2.565417 -4.473601 -0.690009
H  1.765929 -5.549354 0.463919
H  1.279637 -5.561038 -1.23072
totalener: -580.74833366183577 hartree
nucrepener: 841.88273548071186 hartree
electener: -1422.63105957962489 hartree
oneelecener: -2435.69019815149386 hartree
twoeener: 1013.05913857186886 hartree
kineticenergy: 577.81324407912473 hartree
exchangeener: -55.397370555635 hartree
correlationener: -4.258680056573 hartree
xcener: -59.656050612209 hartree
dispersion: -0.064755555 hartree
dispersion: -0.065158377 hartree
dispersion: -0.065171013 hartree
dispersion: -0.065171767 hartree
energy: -286.3493 -286.2709 -284.1893 -284.0751 -283.7694 -283.7477 -283.5858 -283.5061 -283.4752 -283.4384 -283.3432 -283.3046 -283.2493 -283.2172 -282.3656 -32.6276 -31.2728 -30.7086 -28.7648 -28.2568 -28.0060 -27.6291 -25.7290 -25.3634 -24.1141 -23.7194 -23.6306 -22.5730 -21.8439 -21.3769 -20.2770 -20.1304 -20.0755 -19.4054 -19.2441 -18.5516 -18.4763 -18.3901 -18.0364 -17.7927 -17.6854 -17.1817 -16.6627 -16.4025 -16.3302 -16.0804 -15.8744 -15.7389 -13.8732 -13.3902 -13.0483 -12.8078 -4.7424 -2.3045 -1.9460 -1.7528 -1.1520 -0.8888 -0.3554 0.1242 0.4611 0.8946 1.0474 electronvolt
chargesum: 1.0000000
charge: -0.199722 0.342389 -0.417033 0.454508 -0.241042 -0.060761 0.112090 0.112096 0.124878 -0.178419 0.186919 0.233146 0.189690 0.405042 -0.246574 -0.230631 -0.082119 0.121453 -0.075919 0.116309 -0.055355 0.130704 0.128569 0.133940 -0.134777 0.130222 -0.434203 0.131372 0.151917 0.151312
charge: -0.046692 -0.132017 -0.050460 -0.148684 -0.078101 -0.094815 0.145211 0.140118 0.147183 -0.030699 0.169393 0.315747 0.170246 -0.148886 -0.062898 -0.069238 -0.094403 0.146192 -0.094209 0.141508 -0.064313 0.148179 0.147737 0.149322 -0.021957 0.150261 -0.215076 0.121194 0.130236 0.129921
qa: -0.1997 0.3424 -0.4170 0.4545 -0.2410 -0.0608 0.1121 0.1121 0.1249 -0.1784 0.1869 0.2331 0.1897 0.4050 -0.2466 -0.2306 -0.0821 0.1215 -0.0759 0.1163 -0.0554 0.1307 0.1286 0.1339 -0.1348 0.1302 -0.4342 0.1314 0.1519 0.1513
va: 4.0159 3.8070 4.0487 3.6208 4.0522 3.9646 0.9775 0.9707 0.9699 3.7315 0.9501 0.9250 0.9494 3.6853 4.0498 4.0524 3.9691 0.9705 4.0116 0.9707 4.0024 0.9671 0.9689 0.9641 3.6967 0.9641 3.8642 0.9696 0.9567 0.9567
dispersion: -0.065172052 hartree
energy: -580.814598510555 hartree
dipole: 2.495884350 -2.536673170 -0.040788820 -5.644064105 6.124941233 0.480877128 -1.494813156 1.143908648 -0.350904507
dipolemethod: SCF
magnitude: 0.596691305 au
magnitude: 1.516668766 debye
temp: 298.15 k
press: 1.00 atm
zeropoint: 0.25287035 hartree
thermalvibcorrection: 0.01016612 hartree
thermalrotcorrection: 0.00141627 hartree
thermaltrasncorrection: 0.00141627 hartree
thermaltotal: -580.54872950 hartree
thermalcorr: 0.01299866 hartree
nonthermalcorr: 0.25287035 hartree
totalcorr: 0.26586901 hartree
thermalcorrenthalpy: 0.00094421 hartree
totalenthalpy: -580.54778529 hartree
vibrat: 0.01769040 hartree
rotat: 0.01546364 hartree
transl: 0.01981914 hartree
total: 0.05297318 hartree
totalentropycorr: -0.05297318 hartree
gibbsenthalpy: -580.60075847 hartree
gibbsminuselec: 0.21384004 hartree
