program: Orca
programVersion: 6.1.x
elementType: C C C C C C H H H C H H H C C C C H C H C H H H C H C O H
charge: 1
multiplicity: 1
keywords: optts freq wb97x-d3bj def2-tzvp(-f) def2/J tightscf tightopt
frequency: 0.00 0.00 0.00 0.00 0.00 0.00 -712.46 29.18 48.34 50.73 95.59 135.91 172.70 204.87 219.12 244.29 271.19 335.64 411.34 420.97 436.35 467.71 497.58 553.30 557.96 633.93 653.37 687.67 700.49 707.21 779.49 808.71 827.68 867.17 876.62 925.62 945.50 959.17 979.63 997.36 1009.93 1031.76 1031.93 1032.87 1043.70 1055.58 1065.95 1097.79 1128.36 1136.27 1184.60 1196.27 1206.48 1217.47 1222.39 1240.68 1271.36 1325.43 1332.63 1340.10 1356.95 1365.06 1381.38 1418.27 1486.36 1512.42 1545.96 1554.42 1603.56 1664.15 1666.01 1680.24 1686.97 1840.36 2118.45 2968.38 3185.71 3192.23 3195.77 3206.30 3213.95 3217.74 3222.43 3227.10 3235.14 3240.24 3241.68
frequency: 29.18 48.34 50.73 95.59 135.91 172.70 204.87 219.12 244.29 271.19 335.64 411.34 420.97 436.35 467.71 497.58 553.30 557.96 633.93 653.37 687.67 700.49 707.21 779.49 808.71 827.68 867.17 876.62 925.62 945.50 959.17 979.63 997.36 1009.93 1031.76 1031.93 1032.87 1043.70 1055.58 1065.95 1097.79 1128.36 1136.27 1184.60 1196.27 1206.48 1217.47 1222.39 1240.68 1271.36 1325.43 1332.63 1340.10 1356.95 1365.06 1381.38 1418.27 1486.36 1512.42 1545.96 1554.42 1603.56 1664.15 1666.01 1680.24 1686.97 1840.36 2118.45 2968.38 3185.71 3192.23 3195.77 3206.30 3213.95 3217.74 3222.43 3227.10 3235.14 3240.24 3241.68
formula: C15H13O
InChI: InChI=1/C15H13O/c16-10-11-5-4-8-13(9-11)15-14(17-15)12-6-2-1-3-7-12/h1-10,14-15H
29 atoms
C  -0.975295 -3.860941 0.277706
C  0.35339 -3.534563 0.010481
C  0.732742 -2.205957 -0.07435
C  -0.217351 -1.193239 0.097657
C  -1.546878 -1.530816 0.380031
C  -1.921325 -2.861211 0.467173
H  1.76985 -1.953762 -0.279251
H  -2.28757 -0.759996 0.56024
H  -2.948342 -3.119682 0.694357
C  0.230817 0.190063 -0.00226
H  1.300949 0.367884 0.080803
H  -0.053068 0.729365 -1.193343
H  -1.644978 1.146147 -0.316678
C  -0.149825 2.716753 -0.075301
C  -1.005342 3.699489 -0.583278
C  1.06643 3.083071 0.5122
C  -0.639226 5.033708 -0.525369
H  -1.954533 3.415499 -1.026176
C  1.425043 4.41723 0.570067
H  1.720394 2.33817 0.951388
C  0.575996 5.389921 0.047331
H  -1.300397 5.794892 -0.921184
H  2.360791 4.705497 1.033438
H  0.861026 6.434457 0.098876
C  -0.582011 1.322921 -0.16731
H  -1.245688 -4.908999 0.344814
C  1.365806 -4.62213 -0.178182
O  1.086255 -5.788202 -0.122904
H  2.401339 -4.281063 -0.374526
totalener: -654.77537890351095 hartree
nucrepener: 913.19353156552347 hartree
electener: -1567.96890398028199 hartree
oneelecener: -2678.81518149491740 hartree
twoeener: 1110.84627751463540 hartree
kineticenergy: 651.67981807523176 hartree
exchangeener: -60.847525403771 hartree
correlationener: -4.555452912821 hartree
xcener: -65.402978316592 hartree
dispersion: -0.065278154 hartree
dispersion: -0.065663591 hartree
dispersion: -0.065676088 hartree
dispersion: -0.065676914 hartree
energy: -525.9355 -286.6963 -286.5211 -285.1364 -284.5766 -284.3374 -284.2311 -284.2183 -283.8831 -283.8511 -283.8262 -283.7372 -283.6786 -283.5621 -283.4505 -283.4090 -35.3855 -32.9257 -31.6161 -30.9773 -29.0101 -28.6227 -28.1283 -27.8906 -25.7773 -24.9042 -24.4318 -23.9669 -23.6291 -22.6526 -22.0097 -21.5636 -20.6013 -20.4836 -20.3189 -19.8758 -19.5140 -19.1341 -18.8274 -18.6721 -18.5143 -18.2490 -18.0996 -17.9538 -17.2494 -16.8355 -16.6353 -16.5466 -16.3986 -16.1673 -14.1912 -13.6902 -13.4979 -13.2061 -13.1451 -5.0511 -3.0697 -2.5694 -2.0914 -1.5642 -1.2795 -0.6686 -0.0864 0.0456 0.3831 0.8018 electronvolt
chargesum: 1.0000000
charge: -0.190605 0.376859 -0.406918 0.440941 -0.218618 -0.045223 0.123305 0.121848 0.133723 -0.164415 0.189240 0.235818 0.190931 0.400192 -0.247754 -0.229765 -0.081620 0.121105 -0.076608 0.114417 -0.056379 0.131763 0.129484 0.134858 -0.145953 0.160034 0.150739 -0.379633 0.088234
charge: -0.007916 -0.125602 -0.029383 -0.145784 -0.052653 -0.085957 0.149778 0.144014 0.150561 -0.015339 0.170918 0.316664 0.170164 -0.149048 -0.064832 -0.072533 -0.093133 0.146101 -0.093187 0.140881 -0.064531 0.148590 0.148102 0.149689 -0.035621 0.160795 -0.130351 0.051449 0.118161
qa: -0.1906 0.3769 -0.4069 0.4409 -0.2186 -0.0452 0.1233 0.1218 0.1337 -0.1644 0.1892 0.2358 0.1909 0.4002 -0.2478 -0.2298 -0.0816 0.1211 -0.0766 0.1144 -0.0564 0.1318 0.1295 0.1349 -0.1460 0.1600 0.1507 -0.3796 0.0882
va: 4.0095 3.5491 3.9807 3.6534 4.0488 3.9199 0.9802 0.9696 0.9701 3.7281 0.9513 0.9238 0.9468 3.6873 4.0519 4.0507 3.9707 0.9705 4.0160 0.9701 4.0044 0.9669 0.9688 0.9641 3.7039 0.9787 4.0082 2.1305 0.9629
dispersion: -0.065676866 hartree
energy: -654.842106685598 hartree
dipole: -0.993145057 0.624006428 -0.369138630 9.794893987 -7.279154986 2.515739001 -0.722694722 0.420483945 -0.302210777
dipolemethod: SCF
magnitude: 2.560573647 au
magnitude: 6.508460975 debye
temp: 298.15 k
press: 1.00 atm
zeropoint: 0.23442620 hartree
thermalvibcorrection: 0.01036728 hartree
thermalrotcorrection: 0.00141627 hartree
thermaltrasncorrection: 0.00141627 hartree
thermaltotal: -654.59448066 hartree
thermalcorr: 0.01319982 hartree
nonthermalcorr: 0.23442620 hartree
totalcorr: 0.24762602 hartree
thermalcorrenthalpy: 0.00094421 hartree
totalenthalpy: -654.59353645 hartree
vibrat: 0.01801301 hartree
rotat: 0.01568151 hartree
transl: 0.01991708 hartree
total: 0.05361160 hartree
totalentropycorr: -0.05361160 hartree
gibbsenthalpy: -654.64714805 hartree
gibbsminuselec: 0.19495863 hartree
