program: Orca
programVersion: 6.1.x
elementType: C C C C C C H H H H C H H H C C C C H C H C H H H C Cl
charge: 1
multiplicity: 1
keywords: optts freq wb97x-d3bj def2-tzvp(-f) def2/J tightscf tightopt
frequency: 0.00 0.00 0.00 0.00 0.00 0.00 -727.81 36.49 39.40 50.52 112.82 150.46 189.93 241.33 258.11 321.99 373.07 411.20 419.52 440.61 462.09 494.08 535.66 606.49 633.54 650.45 703.91 718.16 738.93 784.30 847.51 856.01 861.60 867.77 894.00 958.90 985.60 1000.87 1006.66 1010.41 1032.10 1043.84 1045.83 1065.53 1097.57 1130.04 1149.92 1154.75 1196.01 1213.45 1219.26 1224.29 1227.49 1256.36 1317.00 1328.11 1333.41 1349.30 1369.39 1383.26 1467.88 1509.80 1544.59 1559.55 1603.30 1645.98 1664.63 1674.88 1681.02 2115.51 3185.85 3195.47 3206.70 3210.05 3215.26 3219.76 3222.59 3235.49 3241.78 3244.69 3245.72
frequency: 36.49 39.40 50.52 112.82 150.46 189.93 241.33 258.11 321.99 373.07 411.20 419.52 440.61 462.09 494.08 535.66 606.49 633.54 650.45 703.91 718.16 738.93 784.30 847.51 856.01 861.60 867.77 894.00 958.90 985.60 1000.87 1006.66 1010.41 1032.10 1043.84 1045.83 1065.53 1097.57 1130.04 1149.92 1154.75 1196.01 1213.45 1219.26 1224.29 1227.49 1256.36 1317.00 1328.11 1333.41 1349.30 1369.39 1383.26 1467.88 1509.80 1544.59 1559.55 1603.30 1645.98 1664.63 1674.88 1681.02 2115.51 3185.85 3195.47 3206.70 3210.05 3215.26 3219.76 3222.59 3235.49 3241.78 3244.69 3245.72
formula: C14H12Cl
InChI: InChI=1/C14H12Cl/c15-12-8-6-11(7-9-12)14-13(16-14)10-4-2-1-3-5-10/h1-9,13-14H
27 atoms
C  -0.042769 -3.763114 0.02344
C  1.185034 -3.24686 -0.376242
C  1.351671 -1.876076 -0.42735
C  0.298153 -1.018784 -0.090413
C  -0.926399 -1.557961 0.3231
C  -1.098797 -2.925847 0.379375
H  1.993407 -3.91737 -0.637459
H  2.307747 -1.465874 -0.735637
H  -1.743824 -0.916108 0.630896
H  -2.036541 -3.355278 0.707534
C  0.533411 0.41833 -0.168153
H  1.570379 0.746656 -0.184032
H  0.061837 0.931851 -1.277805
H  -1.482005 1.099966 -0.211569
C  -0.210552 2.860123 -0.041962
C  -1.259098 3.722528 -0.380778
C  1.00709 3.382967 0.410778
C  -1.085816 5.093097 -0.29037
H  -2.206813 3.315578 -0.718349
C  1.172901 4.752251 0.502018
H  1.813903 2.728178 0.719788
C  0.130031 5.605244 0.147052
H  -1.896237 5.761079 -0.555314
H  2.109702 5.160542 0.861331
H  0.26522 6.678003 0.224315
C  -0.445384 1.425952 -0.159299
Cl -0.259834 -5.466498 0.096964
totalener: -1001.00259104690372 hartree
nucrepener: 913.41851951764738 hartree
electener: -1914.42113056807807 hartree
oneelecener: -3160.01657425113262 hartree
twoeener: 1245.59544368305455 hartree
kineticenergy: 997.60062889947221 hartree
exchangeener: -71.851842631894 hartree
correlationener: -4.812307086712 hartree
xcener: -76.664149718606 hartree
dispersion: -0.064207536 hartree
dispersion: -0.064582080 hartree
dispersion: -0.064593553 hartree
dispersion: -0.064594110 hartree
energy: -2765.7661 -286.4829 -286.4498 -285.1887 -284.3513 -284.2895 -284.0353 -284.0054 -283.8611 -283.8378 -283.6176 -283.5729 -283.5584 -283.4257 -283.3859 -263.3980 -202.3328 -202.0558 -202.0348 -32.8043 -31.8253 -31.1249 -30.2005 -28.5576 -28.3248 -28.0885 -27.3761 -25.4227 -24.4364 -24.1207 -23.7378 -23.0726 -22.0025 -21.9216 -20.4472 -20.3225 -20.0456 -19.7376 -19.4693 -18.9000 -18.7027 -18.6206 -18.4857 -18.1167 -17.8283 -17.1818 -16.8202 -16.5206 -16.3747 -16.1365 -15.6634 -14.5602 -13.7743 -13.6722 -13.4753 -12.7277 -4.9170 -2.5011 -2.1958 -2.0402 -1.3110 -1.0768 -0.5115 -0.1808 0.1726 0.7388 1.0232 electronvolt
chargesum: 1.0000000
charge: 0.253389 -0.216235 -0.254097 0.430017 -0.233924 -0.216846 0.137404 0.123334 0.118764 0.135002 -0.162849 0.190779 0.235068 0.189553 0.408669 -0.245916 -0.231459 -0.082293 0.121783 -0.076774 0.116640 -0.054901 0.131725 0.129513 0.135090 -0.152410 0.070971
charge: -0.378600 -0.102810 -0.059098 -0.151014 -0.065214 -0.102373 0.151863 0.148671 0.143874 0.151452 -0.033171 0.170256 0.315842 0.169910 -0.149264 -0.062525 -0.069257 -0.093573 0.146313 -0.093338 0.141517 -0.062920 0.148566 0.148135 0.149748 -0.023839 0.460849
qa: 0.2534 -0.2162 -0.2541 0.4300 -0.2339 -0.2168 0.1374 0.1233 0.1188 0.1350 -0.1628 0.1908 0.2351 0.1896 0.4087 -0.2459 -0.2315 -0.0823 0.1218 -0.0768 0.1166 -0.0549 0.1317 0.1295 0.1351 -0.1524 0.0710
va: 4.0865 3.9858 4.0090 3.6414 4.0193 4.0523 0.9742 0.9711 0.9708 0.9773 3.7426 0.9473 0.9228 0.9482 3.6829 4.0490 4.0534 3.9718 0.9706 4.0155 0.9704 4.0032 0.9669 0.9688 0.9639 3.7309 1.3283
dispersion: -0.064594279 hartree
energy: -1001.068194139587 hartree
dipole: 1.110625274 -0.975205963 0.135419311 24.092858245 -21.748665425 2.344192819 -1.255084319 0.841574695 -0.413509624
dipolemethod: SCF
magnitude: 2.384233330 au
magnitude: 6.060239511 debye
temp: 298.15 k
press: 1.00 atm
zeropoint: 0.21571928 hartree
thermalvibcorrection: 0.00945012 hartree
thermalrotcorrection: 0.00141627 hartree
thermaltrasncorrection: 0.00141627 hartree
thermaltotal: -1000.84019220 hartree
thermalcorr: 0.01228266 hartree
nonthermalcorr: 0.21571928 hartree
totalcorr: 0.22800194 hartree
thermalcorrenthalpy: 0.00094421 hartree
totalenthalpy: -1000.83924799 hartree
vibrat: 0.01627002 hartree
rotat: 0.01561474 hartree
transl: 0.01995998 hartree
total: 0.05184473 hartree
totalentropycorr: -0.05184473 hartree
gibbsenthalpy: -1000.89109272 hartree
gibbsminuselec: 0.17710142 hartree
