program: Orca
programVersion: 6.1.x
elementType: C C C C C C H H C H H H C C C C H C H C H H H C N O O F F
charge: 1
multiplicity: 1
keywords: optts freq wb97x-d3bj def2-tzvp(-f) def2/J tightscf tightopt
frequency: 0.00 0.00 0.00 0.00 0.00 0.00 -796.53 25.03 32.01 34.82 44.58 89.65 124.19 156.78 163.48 200.33 221.50 234.67 269.88 280.91 324.27 410.18 417.00 429.46 470.31 514.26 528.63 570.54 582.82 592.19 616.76 634.05 640.92 706.15 715.44 761.46 778.43 793.98 862.15 866.01 875.68 890.20 897.96 945.08 982.74 1009.08 1029.08 1032.76 1043.42 1066.25 1082.80 1114.97 1132.00 1162.17 1192.32 1195.94 1214.61 1221.93 1240.72 1253.12 1312.75 1329.10 1337.32 1350.71 1375.82 1416.25 1455.38 1497.97 1512.11 1543.15 1555.02 1602.00 1666.62 1676.46 1679.52 1689.26 1704.78 2151.35 3183.51 3193.09 3205.40 3210.69 3222.48 3234.58 3234.89 3241.78 3247.83
frequency: 25.03 32.01 34.82 44.58 89.65 124.19 156.78 163.48 200.33 221.50 234.67 269.88 280.91 324.27 410.18 417.00 429.46 470.31 514.26 528.63 570.54 582.82 592.19 616.76 634.05 640.92 706.15 715.44 761.46 778.43 793.98 862.15 866.01 875.68 890.20 897.96 945.08 982.74 1009.08 1029.08 1032.76 1043.42 1066.25 1082.80 1114.97 1132.00 1162.17 1192.32 1195.94 1214.61 1221.93 1240.72 1253.12 1312.75 1329.10 1337.32 1350.71 1375.82 1416.25 1455.38 1497.97 1512.11 1543.15 1555.02 1602.00 1666.62 1676.46 1679.52 1689.26 1704.78 2151.35 3183.51 3193.09 3205.40 3210.69 3222.48 3234.58 3234.89 3241.78 3247.83
formula: C14H10F2NO2
InChI: InChI=1/C14H10F2NO2/c15-10-6-9(7-11(16)12(10)17(18)19)14-13(20-14)8-4-2-1-3-5-8/h1-7,13-14H
29 atoms
C  -0.02629 -3.053547 0.008513
C  1.224692 -2.520626 -0.254454
C  1.41191 -1.151829 -0.291884
C  0.316934 -0.31321 -0.060856
C  -0.949183 -0.839497 0.220904
C  -1.103317 -2.209469 0.245679
H  2.400146 -0.761163 -0.503749
H  -1.807193 -0.220697 0.449078
C  0.554122 1.121434 -0.104392
H  1.591612 1.447965 -0.071836
H  0.087332 1.723595 -1.300606
H  -1.454394 1.805215 -0.314546
C  -0.185356 3.569937 -0.068749
C  -1.176524 4.442363 -0.526019
C  0.974858 4.076025 0.524836
C  -1.000164 5.811246 -0.409796
H  -2.082613 4.048204 -0.974971
C  1.143457 5.44422 0.641471
H  1.733397 3.41327 0.926619
C  0.160249 6.310137 0.169771
H  -1.767275 6.487961 -0.765975
H  2.035604 5.839729 1.111712
H  0.296501 7.381016 0.266966
C  -0.418728 2.127203 -0.227491
N  -0.21452 -4.516021 0.048635
O  -0.802486 -4.994335 -0.89088
O  0.238269 -5.0791 1.015077
F  -2.285353 -2.739466 0.520503
F  2.241781 -3.337002 -0.480264
totalener: -944.51993793601480 hartree
nucrepener: 1292.12679184709600 hartree
electener: -2236.64673361223731 hartree
oneelecener: -3833.55721339551337 hartree
twoeener: 1596.91047978327606 hartree
kineticenergy: 940.73668820036778 hartree
exchangeener: -81.491896424806 hartree
correlationener: -5.733725925809 hartree
xcener: -87.225622350615 hartree
dispersion: -0.066914535 hartree
dispersion: -0.067157143 hartree
dispersion: -0.067150100 hartree
dispersion: -0.067125286 hartree
dispersion: -0.067115889 hartree
dispersion: -0.067111856 hartree
dispersion: -0.067109933 hartree
dispersion: -0.067110313 hartree
dispersion: -0.067110932 hartree
dispersion: -0.067110053 hartree
energy: -678.5012 -678.4794 -527.2992 -527.2970 -402.4585 -287.3468 -286.9508 -286.9273 -286.6585 -285.8019 -285.4765 -284.8352 -284.8198 -284.4924 -283.9767 -283.9269 -283.6172 -283.5418 -283.4954 -41.6109 -41.5355 -41.0566 -36.2807 -33.3649 -32.4266 -31.2879 -30.1735 -29.1778 -28.5452 -28.1951 -27.2199 -25.7499 -25.3259 -24.4966 -24.1687 -23.8062 -23.1250 -22.6807 -22.1307 -22.0530 -21.5570 -21.3446 -21.0447 -20.7709 -20.5553 -20.4192 -20.2688 -20.1987 -20.0857 -19.7432 -19.0980 -18.6640 -18.6107 -18.3768 -17.9966 -17.7881 -17.7567 -17.1801 -16.5038 -16.2775 -15.4882 -14.8029 -14.7883 -14.1524 -14.0400 -13.5873 -13.4106 -5.6798 -2.9853 -2.7011 -2.6046 -2.2355 -1.8581 -1.3781 -0.8998 -0.4901 -0.1522 0.3539 electronvolt
chargesum: 1.0000000
charge: 0.126625 0.265242 -0.298095 0.465520 -0.295946 0.278917 0.141533 0.133264 -0.141021 0.200106 0.242134 0.197730 0.394822 -0.250511 -0.228785 -0.079950 0.121086 -0.078040 0.111893 -0.059293 0.132945 0.130366 0.135433 -0.170295 0.476681 -0.286022 -0.284087 -0.192110 -0.190140
charge: -0.026422 -0.128508 -0.029967 -0.131805 -0.037193 -0.127970 0.160501 0.155956 0.027318 0.174055 0.317783 0.170930 -0.148354 -0.068509 -0.078382 -0.091477 0.146077 -0.091983 0.139922 -0.066110 0.149003 0.148433 0.149932 -0.062931 0.000008 0.011270 0.012941 0.162002 0.163481
qa: 0.1266 0.2652 -0.2981 0.4655 -0.2959 0.2789 0.1415 0.1333 -0.1410 0.2001 0.2421 0.1977 0.3948 -0.2505 -0.2288 -0.0800 0.1211 -0.0780 0.1119 -0.0593 0.1329 0.1304 0.1354 -0.1703 0.4767 -0.2860 -0.2841 -0.1921 -0.1901
va: 3.9231 4.0693 3.9116 3.5161 3.9263 4.1145 0.9762 0.9825 3.7396 0.9469 0.9214 0.9388 3.6822 4.0534 4.0468 3.9717 0.9705 4.0227 0.9691 4.0074 0.9665 0.9686 0.9641 3.7407 4.2819 2.0242 2.0256 1.1551 1.1587
dispersion: -0.067110358 hartree
energy: -944.588786104259 hartree
dipole: 1.019934368 -0.612501839 0.407432529 35.687457871 -30.697198957 4.990258914 -1.158590253 0.701072175 -0.457518078
dipolemethod: SCF
magnitude: 5.027723947 au
magnitude: 12.779458672 debye
temp: 298.15 k
press: 1.00 atm
zeropoint: 0.21074300 hartree
thermalvibcorrection: 0.01283252 hartree
thermalrotcorrection: 0.00141627 hartree
thermaltrasncorrection: 0.00141627 hartree
thermaltotal: -944.36237803 hartree
thermalcorr: 0.01566507 hartree
nonthermalcorr: 0.21074300 hartree
totalcorr: 0.22640807 hartree
thermalcorrenthalpy: 0.00094421 hartree
totalenthalpy: -944.36143383 hartree
vibrat: 0.02284604 hartree
rotat: 0.01620218 hartree
transl: 0.02023663 hartree
total: 0.05928486 hartree
totalentropycorr: -0.05928486 hartree
gibbsenthalpy: -944.42071868 hartree
gibbsminuselec: 0.16806742 hartree
