program: Orca
programVersion: 6.1.x
elementType: C C C C C C H H H H C H H H C C C C H C H C H H H C C F F F
charge: 1
multiplicity: 1
keywords: optts freq wb97x-d3bj def2-tzvp(-f) def2/J tightscf tightopt
frequency: 0.00 0.00 0.00 0.00 0.00 0.00 -729.07 15.06 33.59 35.65 45.91 99.22 130.33 164.41 192.69 229.29 247.78 310.66 375.10 388.77 406.10 410.49 417.37 468.08 494.52 526.29 583.82 588.63 607.35 634.00 651.44 673.94 705.85 758.52 775.60 786.79 850.72 862.60 867.27 875.19 896.93 954.58 987.95 1005.00 1009.43 1012.26 1032.27 1042.96 1045.77 1066.08 1095.68 1105.98 1131.49 1153.17 1195.20 1195.31 1212.67 1218.62 1224.02 1225.34 1230.45 1256.31 1321.27 1330.82 1337.57 1349.32 1359.83 1370.57 1383.93 1471.59 1510.52 1550.10 1572.99 1602.85 1660.36 1666.51 1680.70 1702.47 2121.04 3185.48 3195.02 3205.84 3212.85 3213.55 3222.26 3222.94 3234.94 3238.19 3241.59 3251.08
frequency: 15.06 33.59 35.65 45.91 99.22 130.33 164.41 192.69 229.29 247.78 310.66 375.10 388.77 406.10 410.49 417.37 468.08 494.52 526.29 583.82 588.63 607.35 634.00 651.44 673.94 705.85 758.52 775.60 786.79 850.72 862.60 867.27 875.19 896.93 954.58 987.95 1005.00 1009.43 1012.26 1032.27 1042.96 1045.77 1066.08 1095.68 1105.98 1131.49 1153.17 1195.20 1195.31 1212.67 1218.62 1224.02 1225.34 1230.45 1256.31 1321.27 1330.82 1337.57 1349.32 1359.83 1370.57 1383.93 1471.59 1510.52 1550.10 1572.99 1602.85 1660.36 1666.51 1680.70 1702.47 2121.04 3185.48 3195.02 3205.84 3212.85 3213.55 3222.26 3222.94 3234.94 3238.19 3241.59 3251.08
formula: C15H12F3
InChI: InChI=1/C15H12F3/c16-15(17,18)12-8-6-11(7-9-12)14-13(19-14)10-4-2-1-3-5-10/h1-9,13-14H
30 atoms
C  0.052171 -3.045744 -0.012159
C  1.263738 -2.506705 -0.415831
C  1.410326 -1.128952 -0.460106
C  0.343737 -0.297044 -0.11017
C  -0.872012 -0.855267 0.30925
C  -1.014768 -2.226203 0.35536
H  2.085607 -3.155386 -0.689073
H  2.356061 -0.698152 -0.771377
H  -1.695963 -0.226932 0.625906
H  -1.946581 -2.668733 0.686608
C  0.556104 1.142624 -0.174303
H  1.587257 1.485432 -0.229743
H  0.008993 1.697036 -1.28815
H  -1.470045 1.796915 -0.175813
C  -0.213415 3.577792 -0.040947
C  -1.268694 4.431627 -0.37514
C  0.999107 4.107504 0.412933
C  -1.106773 5.80358 -0.277838
H  -2.213512 4.019023 -0.714114
C  1.153659 5.478395 0.511473
H  1.812055 3.458704 0.719154
C  0.104362 6.324665 0.161551
H  -1.923435 6.46543 -0.53912
H  2.087356 5.891881 0.873008
H  0.230314 7.398067 0.244359
C  -0.436262 2.135489 -0.168216
C  -0.14785 -4.548372 0.056772
F  -1.155405 -4.922402 -0.747449
F  -0.464043 -4.921364 1.306522
F  0.949557 -5.217653 -0.312283
totalener: -878.60240890973489 hartree
nucrepener: 1176.05981483217943 hartree
electener: -2054.66224118545415 hartree
oneelecener: -3515.42591084290098 hartree
twoeener: 1460.76366965744683 hartree
kineticenergy: 874.90295354006332 hartree
exchangeener: -76.391091564207 hartree
correlationener: -5.438249165314 hartree
xcener: -81.829340729521 hartree
dispersion: -0.066378889 hartree
dispersion: -0.066747455 hartree
dispersion: -0.066759198 hartree
dispersion: -0.066760028 hartree
dispersion: -0.066759450 hartree
energy: -677.5655 -677.4610 -677.4585 -289.4652 -286.8013 -286.4900 -284.6789 -284.3348 -284.3272 -284.2554 -284.2456 -283.9145 -283.8711 -283.8562 -283.8198 -283.5273 -283.4288 -283.3869 -42.3061 -39.8559 -39.7467 -32.9602 -31.7454 -31.0330 -29.3445 -28.5478 -28.1790 -28.0456 -26.4568 -25.2884 -24.6355 -24.2318 -23.9245 -23.2638 -22.6086 -22.2741 -22.2488 -21.9598 -21.7447 -20.4654 -20.3980 -19.8923 -19.5359 -19.5193 -18.9656 -18.8140 -18.7693 -18.7297 -18.5335 -18.4659 -18.0104 -17.8653 -17.5740 -17.5185 -17.0835 -17.0476 -16.6132 -16.3945 -16.2418 -16.1423 -14.3299 -13.8793 -13.4739 -13.2614 -5.1431 -2.6761 -2.3735 -2.0832 -1.5500 -1.1748 -0.6314 -0.0998 0.3127 0.8904 0.9499 electronvolt
chargesum: 1.0000000
charge: 0.334491 -0.225110 -0.216567 0.430565 -0.217864 -0.221906 0.149587 0.126827 0.122694 0.141552 -0.152594 0.192987 0.237431 0.193064 0.401923 -0.250169 -0.229666 -0.080736 0.120674 -0.077401 0.113844 -0.058106 0.131581 0.129188 0.134417 -0.160497 0.475109 -0.181575 -0.180899 -0.182846
charge: -0.066296 -0.054352 -0.049644 -0.141075 -0.057941 -0.050677 0.157377 0.149778 0.145165 0.158501 -0.002457 0.171729 0.317242 0.170247 -0.148704 -0.066533 -0.074405 -0.093101 0.145929 -0.093261 0.140620 -0.066000 0.148474 0.147987 0.149511 -0.044007 -0.347120 0.115395 0.116117 0.121500
qa: 0.3345 -0.2251 -0.2166 0.4306 -0.2179 -0.2219 0.1496 0.1268 0.1227 0.1416 -0.1526 0.1930 0.2374 0.1931 0.4019 -0.2502 -0.2297 -0.0807 0.1207 -0.0774 0.1138 -0.0581 0.1316 0.1292 0.1344 -0.1605 0.4751 -0.1816 -0.1809 -0.1828
va: 3.8812 3.9056 3.9196 3.6759 3.9966 4.0723 0.9776 0.9717 0.9721 0.9815 3.7408 0.9491 0.9229 0.9446 3.6818 4.0522 4.0497 3.9708 0.9707 4.0173 0.9698 4.0056 0.9667 0.9688 0.9642 3.7281 4.4256 1.1311 1.1318 1.1341
dispersion: -0.066759548 hartree
energy: -878.670246456309 hartree
dipole: 1.547022529 -1.267717867 0.279304662 39.189168100 -35.017883351 4.171284749 -1.432658204 0.966170379 -0.466487824
dipolemethod: SCF
magnitude: 4.206570865 au
magnitude: 10.692253412 debye
temp: 298.15 k
press: 1.00 atm
zeropoint: 0.22992779 hartree
thermalvibcorrection: 0.01192603 hartree
thermalrotcorrection: 0.00141627 hartree
thermaltrasncorrection: 0.00141627 hartree
thermaltotal: -878.42556009 hartree
thermalcorr: 0.01475857 hartree
nonthermalcorr: 0.22992779 hartree
totalcorr: 0.24468636 hartree
thermalcorrenthalpy: 0.00094421 hartree
totalenthalpy: -878.42461588 hartree
vibrat: 0.02122261 hartree
rotat: 0.01605564 hartree
transl: 0.02016473 hartree
total: 0.05744298 hartree
totalentropycorr: -0.05744298 hartree
gibbsenthalpy: -878.48205886 hartree
gibbsminuselec: 0.18818760 hartree
