program: Orca
programVersion: 6.1.x
elementType: C C C C C C H H H H C H H H C C C C H C H C H H H C C C H H H
charge: 1
multiplicity: 1
keywords: optts freq wb97x-d3bj def2-tzvp(-f) def2/J tightscf tightopt
frequency: 0.00 0.00 0.00 0.00 0.00 0.00 -776.31 31.88 37.63 50.65 57.30 119.42 147.85 196.75 235.50 254.10 278.86 361.97 411.14 416.79 438.86 469.49 483.08 517.49 551.46 625.35 633.48 651.05 658.67 703.79 766.04 772.00 792.55 853.49 859.82 867.70 876.74 897.67 960.06 983.83 997.08 1002.22 1006.57 1010.75 1032.04 1037.72 1043.47 1044.33 1060.07 1065.31 1094.26 1129.44 1163.63 1196.02 1213.42 1216.12 1222.09 1232.27 1253.48 1260.82 1322.01 1331.26 1334.51 1348.52 1365.37 1373.77 1384.36 1466.39 1482.67 1509.63 1547.74 1570.69 1603.91 1643.06 1663.68 1680.31 1686.78 1733.29 2115.67 3181.61 3185.65 3195.00 3195.24 3203.78 3207.13 3212.53 3216.43 3222.82 3224.53 3235.64 3239.08 3241.72 3270.29
frequency: 31.88 37.63 50.65 57.30 119.42 147.85 196.75 235.50 254.10 278.86 361.97 411.14 416.79 438.86 469.49 483.08 517.49 551.46 625.35 633.48 651.05 658.67 703.79 766.04 772.00 792.55 853.49 859.82 867.70 876.74 897.67 960.06 983.83 997.08 1002.22 1006.57 1010.75 1032.04 1037.72 1043.47 1044.33 1060.07 1065.31 1094.26 1129.44 1163.63 1196.02 1213.42 1216.12 1222.09 1232.27 1253.48 1260.82 1322.01 1331.26 1334.51 1348.52 1365.37 1373.77 1384.36 1466.39 1482.67 1509.63 1547.74 1570.69 1603.91 1643.06 1663.68 1680.31 1686.78 1733.29 2115.67 3181.61 3185.65 3195.00 3195.24 3203.78 3207.13 3212.53 3216.43 3222.82 3224.53 3235.64 3239.08 3241.72 3270.29
formula: C16H15
InChI: InChI=1/C16H15/c1-2-12-8-10-14(11-9-12)16-15(17-16)13-6-4-3-5-7-13/h2-11,15-16H,1H2
31 atoms
C  0.140908 -3.867483 0.069475
C  1.355882 -3.283668 -0.300769
C  1.492065 -1.910108 -0.367076
C  0.409559 -1.080458 -0.062362
C  -0.804438 -1.656591 0.334996
C  -0.932056 -3.026863 0.400912
H  2.200373 -3.91962 -0.540568
H  2.442607 -1.475642 -0.659791
H  -1.643858 -1.036575 0.629566
H  -1.867015 -3.454375 0.740031
C  0.602807 0.363864 -0.15389
H  1.629456 0.72311 -0.145672
H  0.155743 0.828208 -1.266352
H  -1.431674 0.981227 -0.220362
C  -0.222591 2.779614 -0.040369
C  -1.301831 3.603936 -0.380814
C  0.977761 3.34827 0.405934
C  -1.176509 4.979987 -0.298751
H  -2.235432 3.16169 -0.713177
C  1.095794 4.722637 0.4885
H  1.807753 2.723484 0.715142
C  0.022256 5.536445 0.13193
H  -2.010327 5.617994 -0.564931
H  2.018814 5.16595 0.84191
H  0.120201 6.613751 0.202436
C  -0.407718 1.341208 -0.146466
C  0.038591 -5.336149 0.116465
C  -1.0954 -6.026457 0.177835
H  0.983374 -5.870101 0.070729
H  -1.082707 -7.109464 0.197474
H  -2.070264 -5.551796 0.196752
totalener: -618.85283507629765 hartree
nucrepener: 908.34198469773241 hartree
electener: -1527.19483852932649 hartree
oneelecener: -2618.68009611397974 hartree
twoeener: 1091.48525758465325 hartree
kineticenergy: 615.75331444922131 hartree
exchangeener: -58.918575461551 hartree
correlationener: -4.509079389956 hartree
xcener: -63.427654851506 hartree
dispersion: -0.068707224 hartree
dispersion: -0.069140520 hartree
dispersion: -0.069153068 hartree
dispersion: -0.069140909 hartree
dispersion: -0.069163174 hartree
dispersion: -0.069162158 hartree
dispersion: -0.069162331 hartree
dispersion: -0.069162958 hartree
dispersion: -0.069162887 hartree
dispersion: -0.069162944 hartree
energy: -286.3609 -286.1088 -284.1921 -283.9760 -283.7944 -283.7804 -283.6063 -283.5940 -283.5690 -283.5147 -283.3611 -283.3240 -283.1559 -283.0915 -282.6012 -282.4032 -32.5556 -31.2701 -30.7158 -28.9903 -28.1322 -27.9959 -27.8547 -26.9084 -25.3078 -24.2249 -23.9645 -23.7969 -22.8526 -22.0332 -21.8289 -21.4620 -20.2852 -20.1100 -19.7222 -19.4550 -19.2166 -18.7570 -18.4600 -18.3760 -18.3469 -18.0458 -17.5852 -17.2875 -16.8739 -16.6692 -16.3042 -16.0841 -15.8249 -15.3888 -14.5838 -13.5010 -13.4119 -13.2562 -12.0047 -4.7693 -2.5103 -1.9866 -1.8121 -1.2268 -1.0025 -0.4008 0.0815 0.4797 0.5899 1.0589 electronvolt
chargesum: 1.0000000
charge: 0.462829 -0.236397 -0.244132 0.420051 -0.223209 -0.246293 0.120702 0.114596 0.106942 0.115331 -0.193359 0.187160 0.233588 0.188448 0.413608 -0.241875 -0.233146 -0.084294 0.121961 -0.076766 0.118266 -0.052898 0.131062 0.129013 0.134715 -0.135968 -0.201285 -0.184457 0.112042 0.132469 0.111294
charge: -0.080763 -0.070058 -0.066234 -0.152796 -0.074629 -0.062584 0.148598 0.145651 0.140388 0.146524 -0.049776 0.168785 0.314187 0.169450 -0.149203 -0.060423 -0.066106 -0.094520 0.146396 -0.093968 0.142043 -0.062039 0.148320 0.147960 0.149586 -0.011408 -0.139748 -0.119205 0.143285 0.125909 0.116378
qa: 0.4628 -0.2364 -0.2441 0.4201 -0.2232 -0.2463 0.1207 0.1146 0.1069 0.1153 -0.1934 0.1872 0.2336 0.1884 0.4136 -0.2419 -0.2331 -0.0843 0.1220 -0.0768 0.1183 -0.0529 0.1311 0.1290 0.1347 -0.1360 -0.2013 -0.1845 0.1120 0.1325 0.1113
va: 3.7608 3.9349 3.9685 3.6620 4.0232 4.0511 0.9736 0.9732 0.9733 0.9805 3.7541 0.9469 0.9231 0.9496 3.6810 4.0454 4.0561 3.9720 0.9706 4.0128 0.9710 4.0008 0.9671 0.9689 0.9639 3.7170 3.9283 3.9409 0.9723 0.9778 0.9761
dispersion: -0.069162947 hartree
energy: -618.923212671972 hartree
dipole: -1.013985725 1.007980228 -0.006005497 -2.661277198 3.863873477 1.202596279 -0.755713515 0.371490671 -0.384222844
dipolemethod: SCF
magnitude: 1.262497949 au
magnitude: 3.209014762 debye
temp: 298.15 k
press: 1.00 atm
zeropoint: 0.25843225 hartree
thermalvibcorrection: 0.01074123 hartree
thermalrotcorrection: 0.00141627 hartree
thermaltrasncorrection: 0.00141627 hartree
thermaltotal: -618.65120665 hartree
thermalcorr: 0.01357378 hartree
nonthermalcorr: 0.25843225 hartree
totalcorr: 0.27200602 hartree
thermalcorrenthalpy: 0.00094421 hartree
totalenthalpy: -618.65026244 hartree
vibrat: 0.01866171 hartree
rotat: 0.01561582 hartree
transl: 0.01990367 hartree
total: 0.05418120 hartree
totalentropycorr: -0.05418120 hartree
gibbsenthalpy: -618.70444364 hartree
gibbsminuselec: 0.21876903 hartree
