program: Orca
programVersion: 6.1.x
elementType: C C C C C C H H C H H H C C C C H C H C H H H C F F F
charge: 1
multiplicity: 1
keywords: opt wb97x-d3bj def2-tzvp(-f) def2/J tightscf tightopt
formula: C14H10F3
InChI: InChI=1/C14H10F3/c15-12-8-11(9-13(16)14(12)17)7-6-10-4-2-1-3-5-10/h1-6,8-9H,7H2
27 atoms
C  -0.523556 -3.263532 -0.117065
C  0.861676 -3.191553 -0.047092
C  1.49992 -2.018806 0.31374
C  0.737807 -0.897823 0.622817
C  -0.650446 -0.942954 0.543765
C  -1.26596 -2.128037 0.182378
H  2.581955 -2.012896 0.368356
H  -1.272543 -0.085452 0.773397
C  1.428789 0.398126 1.028129
H  1.028287 0.777584 1.966676
H  2.495187 0.196572 1.172573
H  1.803949 1.068176 -1.001484
C  0.592086 2.547543 -0.111652
C  0.58703 3.292044 -1.328722
C  -0.126699 3.047322 1.014733
C  -0.100386 4.477598 -1.413884
H  1.133761 2.906422 -2.182592
C  -0.811092 4.230464 0.916068
H  -0.133317 2.493904 1.944919
C  -0.795351 4.939756 -0.293437
H  -0.108327 5.048556 -2.333753
H  -1.361532 4.620908 1.762872
H  -1.340398 5.875832 -0.360107
C  1.302749 1.361456 -0.079683
F  -2.59372 -2.195634 0.112844
F  -1.125934 -4.391462 -0.460863
F  1.571904 -4.278681 -0.331823
totalener: -839.24047993066392 hartree
nucrepener: 1093.33080353534956 hartree
electener: -1932.57127477210884 hartree
oneelecener: -3298.88825410753907 hartree
twoeener: 1366.31697933543023 hartree
kineticenergy: 835.88801764155710 hartree
exchangeener: -72.543215693554 hartree
correlationener: -5.116542491292 hartree
xcener: -77.659758184846 hartree
dispersion: -0.062404250 hartree
dispersion: -0.062658834 hartree
dispersion: -0.062700760 hartree
dispersion: -0.062707378 hartree
dispersion: -0.062714491 hartree
dispersion: -0.062721538 hartree
dispersion: -0.062728475 hartree
dispersion: -0.062730168 hartree
dispersion: -0.062731107 hartree
energy: -677.4955 -677.4735 -677.4436 -286.6379 -285.6675 -285.6389 -285.5554 -285.2484 -285.2473 -285.2001 -285.1777 -284.6429 -284.5285 -284.4921 -284.3041 -283.5809 -283.4899 -40.7455 -40.4477 -40.1738 -32.7047 -31.6242 -30.7519 -29.3519 -29.1761 -27.9649 -27.5832 -26.1895 -25.1103 -24.4861 -24.2219 -23.6102 -22.4980 -22.0730 -21.7781 -21.3743 -21.1706 -20.7510 -20.4034 -20.1642 -19.8703 -19.6641 -19.6020 -19.1755 -19.1490 -18.7943 -18.6099 -18.3611 -18.2734 -17.9894 -17.5945 -17.1841 -17.1088 -16.7001 -16.2687 -16.2456 -15.1528 -14.6763 -12.9543 -12.7776 -6.3547 -2.9424 -2.2355 -1.7585 -1.4299 -0.6779 -0.4326 -0.1432 0.1154 0.5415 0.7484 electronvolt
chargesum: 1.0000000
charge: 0.209850 0.293448 -0.327898 0.429003 -0.313872 0.286256 0.124251 0.117077 -0.368136 0.184020 0.195232 0.173478 0.400168 -0.197864 -0.218565 -0.076130 0.148457 -0.071686 0.145139 0.003750 0.150316 0.148615 0.159840 0.016689 -0.209962 -0.195318 -0.206158
charge: -0.123199 -0.137754 -0.074963 -0.127012 -0.079765 -0.139386 0.152711 0.148116 -0.153523 0.147025 0.169569 0.166822 -0.134231 0.007848 -0.003303 -0.086315 0.157332 -0.084663 0.152571 0.009351 0.155893 0.155464 0.159310 0.125452 0.137793 0.155957 0.142902
qa: 0.2099 0.2934 -0.3279 0.4290 -0.3139 0.2863 0.1243 0.1171 -0.3681 0.1840 0.1952 0.1735 0.4002 -0.1979 -0.2186 -0.0761 0.1485 -0.0717 0.1451 0.0037 0.1503 0.1486 0.1598 0.0167 -0.2100 -0.1953 -0.2062
va: 3.9612 3.9799 3.9529 3.4964 3.9446 3.9976 0.9787 0.9770 3.9183 0.9434 0.9554 0.9562 3.7522 4.0243 4.0224 3.9613 0.9692 3.9831 0.9737 3.9574 0.9648 0.9657 0.9578 3.7085 1.1177 1.1425 1.1236
dispersion: -0.062729916 hartree
energy: -839.304161366598 hartree
dipole: 6.604681496 -5.469971392 1.134710104 30.873139550 -25.526620769 5.346518781 2.498355153 -2.390995518 0.107359634
dipolemethod: SCF
magnitude: 5.466658594 au
magnitude: 13.895141881 debye
