program: Orca
programVersion: 6.1.x
elementType: C C C C C C H H H C H H H C C C C H C H C H H H C O H O H
charge: 1
multiplicity: 1
keywords: opt wb97x-d3bj def2-tzvp(-f) def2/J tightscf tightopt
formula: C14H13O2
InChI: InChI=1/C14H13O2/c15-13-9-8-12(10-14(13)16)7-6-11-4-2-1-3-5-11/h1-6,8-10,15-16H,7H2
29 atoms
C  -0.099177 -3.509524 -0.295915
C  1.266443 -3.279537 -0.351035
C  1.785569 -2.061501 0.06448
C  0.944081 -1.070117 0.551087
C  -0.437314 -1.28473 0.583851
C  -0.953314 -2.499857 0.178318
H  1.911698 -4.072222 -0.709602
H  2.857697 -1.900761 0.032989
H  -1.109775 -0.512334 0.94826
C  1.514363 0.263351 1.014089
H  1.062492 0.582975 1.951947
H  2.588628 0.137898 1.184871
H  1.905861 1.028994 -0.971814
C  0.510409 2.355163 -0.101102
C  0.475672 3.124808 -1.297574
C  -0.282728 2.757866 1.009811
C  -0.313427 4.247669 -1.378594
H  1.080987 2.812088 -2.141616
C  -1.067515 3.879392 0.917287
H  -0.264175 2.183132 1.926776
C  -1.079922 4.618965 -0.272637
H  -0.343009 4.838437 -2.285474
H  -1.673061 4.198093 1.75657
H  -1.702562 5.505463 -0.334807
C  1.342059 1.243147 -0.064572
O  -0.592441 -4.697876 -0.693989
H  -1.551011 -4.701431 -0.569484
O  -2.279857 -2.825242 0.188583
H  -2.800553 -2.145649 0.626942
totalener: -691.94307307370013 hartree
nucrepener: 979.92301160127886 hartree
electener: -1671.86606196704929 hartree
oneelecener: -2865.22162330030460 hartree
twoeener: 1193.35556133325531 hartree
kineticenergy: 688.88896821802541 hartree
exchangeener: -63.173165679124 hartree
correlationener: -4.675912962547 hartree
xcener: -67.849078641671 hartree
dispersion: -0.065642467 hartree
dispersion: -0.065900117 hartree
dispersion: -0.065928206 hartree
dispersion: -0.065920786 hartree
dispersion: -0.065910737 hartree
dispersion: -0.065905885 hartree
dispersion: -0.065902206 hartree
dispersion: -0.065896846 hartree
dispersion: -0.065896158 hartree
dispersion: -0.065896358 hartree
dispersion: -0.065896372 hartree
dispersion: -0.065897643 hartree
dispersion: -0.065898818 hartree
dispersion: -0.065900177 hartree
energy: -526.9894 -526.4487 -286.3174 -284.9280 -284.9111 -284.8868 -284.8515 -284.4869 -284.3478 -284.2643 -284.2210 -284.1913 -283.5298 -283.1058 -282.8384 -282.5823 -36.0849 -35.1944 -32.3950 -30.9953 -30.1476 -29.0356 -28.6663 -27.2962 -26.8895 -25.6918 -24.8149 -24.1329 -23.7130 -22.8229 -22.1994 -21.4744 -21.3612 -20.9332 -20.4266 -19.7932 -19.5096 -19.3748 -18.9904 -18.9195 -18.2682 -18.1947 -18.1112 -17.8364 -17.3544 -17.1252 -16.8473 -16.5871 -16.2643 -16.1241 -15.4408 -15.3429 -14.7695 -14.3909 -12.4367 -11.4139 -6.0214 -2.6924 -1.8720 -1.3108 -0.7397 -0.4629 -0.2534 -0.0280 0.1594 0.8078 0.8475 electronvolt
chargesum: 1.0000000
charge: 0.230700 -0.165370 -0.257796 0.405593 -0.321588 0.322017 0.120572 0.106668 0.093641 -0.386896 0.178311 0.195723 0.172093 0.409643 -0.204554 -0.227816 -0.076899 0.144727 -0.076197 0.141236 -0.004526 0.146357 0.143628 0.154811 0.014273 -0.406315 0.312508 -0.460610 0.296068
charge: -0.162317 -0.079461 -0.104822 -0.142476 -0.100558 -0.174994 0.151240 0.142132 0.135710 -0.164407 0.143799 0.168172 0.165806 -0.136112 0.001282 -0.010313 -0.089400 0.156070 -0.089275 0.150669 -0.002793 0.154213 0.153281 0.157206 0.129585 0.053953 0.193119 0.014941 0.185750
qa: 0.2307 -0.1654 -0.2578 0.4056 -0.3216 0.3220 0.1206 0.1067 0.0936 -0.3869 0.1783 0.1957 0.1721 0.4096 -0.2046 -0.2278 -0.0769 0.1447 -0.0762 0.1412 -0.0045 0.1464 0.1436 0.1548 0.0143 -0.4063 0.3125 -0.4606 0.2961
va: 4.1497 3.9810 4.0255 3.6530 3.9729 3.8161 0.9816 0.9717 0.9787 3.9251 0.9477 0.9543 0.9558 3.7422 4.0273 4.0273 3.9594 0.9701 3.9825 0.9754 3.9648 0.9655 0.9669 0.9589 3.6973 2.1318 0.9294 2.0445 0.9370
dispersion: -0.065901084 hartree
energy: -692.010043265637 hartree
dipole: 1.837944002 -1.924174759 -0.086230757 7.742983256 -3.952291207 3.790692049 1.318449192 -1.088976327 0.229472864
dipolemethod: SCF
magnitude: 3.798610239 au
magnitude: 9.655299908 debye
