program: Orca
programVersion: 6.1.x
elementType: C C C C C C H H H H C H H H C C C C H C H C H H H C N C C H H H H H H
charge: 1
multiplicity: 1
keywords: opt wb97x-d3bj def2-tzvp(-f) def2/J tightscf tightopt
formula: C16H18N
InChI: InChI=1/C16H18N/c1-17(2)16-12-10-15(11-13-16)9-8-14-6-4-3-5-7-14/h3-8,10-13H,9H2,1-2H3
35 atoms
C  -0.093101 -2.938472 0.055247
C  1.244584 -2.722789 -0.35265
C  1.838182 -1.489094 -0.204085
C  1.152232 -0.419629 0.374724
C  -0.179473 -0.611102 0.745288
C  -0.791501 -1.838899 0.607055
H  1.823324 -3.531259 -0.775975
H  2.869904 -1.362728 -0.517382
H  -0.749054 0.209891 1.171496
H  -1.817085 -1.949802 0.928725
C  1.820518 0.932061 0.546167
H  1.695026 1.311286 1.560152
H  2.893978 0.812469 0.370175
H  1.583811 1.628845 -1.490903
C  0.384287 2.892355 -0.28831
C  -0.04732 3.607548 -1.437402
C  -0.097905 3.276845 0.991629
C  -0.917609 4.665318 -1.311867
H  0.321079 3.308089 -2.412661
C  -0.970212 4.331617 1.105397
H  0.219731 2.738711 1.875319
C  -1.375357 5.02186 -0.042673
H  -1.247197 5.21541 -2.184324
H  -1.3437 4.632666 2.076265
H  -2.063077 5.85497 0.057594
C  1.287332 1.845398 -0.465579
N  -0.683098 -4.155152 -0.078059
C  -2.054809 -4.353844 0.358666
C  0.050661 -5.264927 -0.664545
H  -2.332563 -5.39214 0.193692
H  -2.168182 -4.138202 1.425755
H  -2.751085 -3.7221 -0.202657
H  -0.593078 -6.140923 -0.68936
H  0.360651 -5.042346 -1.690425
H  0.939201 -5.513203 -0.075449
totalener: -675.49088203983638 hartree
nucrepener: 1076.01748744387851 hartree
electener: -1751.50837530724493 hartree
oneelecener: -3029.29414118654313 hartree
twoeener: 1277.78576587929820 hartree
kineticenergy: 672.18920758875288 hartree
exchangeener: -64.054830222329 hartree
correlationener: -4.921653827478 hartree
xcener: -68.976484049807 hartree
dispersion: -0.076683426 hartree
dispersion: -0.077051257 hartree
dispersion: -0.077099595 hartree
dispersion: -0.077126799 hartree
dispersion: -0.077126497 hartree
dispersion: -0.077127178 hartree
dispersion: -0.077127746 hartree
dispersion: -0.077128781 hartree
dispersion: -0.077130573 hartree
dispersion: -0.077130196 hartree
dispersion: -0.077128660 hartree
energy: -395.5580 -285.9055 -284.5200 -284.4904 -284.4782 -284.4610 -283.8968 -283.8676 -283.7996 -283.7416 -283.0402 -282.8256 -282.8054 -282.7804 -282.7036 -282.3049 -282.3012 -32.5103 -32.0116 -30.6036 -29.7342 -28.6534 -28.3069 -27.1543 -26.7393 -25.9389 -25.5175 -24.4838 -24.1093 -23.1767 -22.9860 -21.9049 -21.8004 -20.7128 -20.4602 -20.0399 -19.5831 -19.2433 -19.0050 -18.8991 -18.5801 -18.4162 -18.3236 -17.8249 -17.6493 -17.5484 -17.0058 -16.7218 -16.6882 -16.5042 -16.4673 -16.0639 -15.9438 -15.9202 -14.8863 -14.4962 -14.0126 -13.5548 -12.5618 -10.4556 -5.6677 -2.3420 -1.5401 -1.1388 -0.5539 -0.1447 0.1189 0.4019 0.7104 1.0259 1.1906 electronvolt
chargesum: 1.0000000
charge: 0.344308 -0.219981 -0.281768 0.409246 -0.247808 -0.230723 0.118603 0.099408 0.095968 0.112863 -0.381958 0.175002 0.184132 0.162709 0.408523 -0.213493 -0.228211 -0.077089 0.139427 -0.078097 0.143540 -0.012004 0.141179 0.139576 0.149418 0.019249 -0.122646 -0.294887 -0.295746 0.144597 0.138886 0.135559 0.143758 0.137831 0.140625
charge: -0.125994 -0.104538 -0.094163 -0.149291 -0.097169 -0.111594 0.143494 0.141798 0.138168 0.141645 -0.174219 0.143408 0.163388 0.162895 -0.137522 -0.007309 -0.015944 -0.092933 0.153944 -0.091905 0.150177 -0.013579 0.152192 0.151767 0.155053 0.123241 0.070149 -0.227559 -0.226894 0.116788 0.111972 0.110352 0.116676 0.111308 0.112199
qa: 0.3443 -0.2200 -0.2818 0.4092 -0.2478 -0.2307 0.1186 0.0994 0.0960 0.1129 -0.3820 0.1750 0.1841 0.1627 0.4085 -0.2135 -0.2282 -0.0771 0.1394 -0.0781 0.1435 -0.0120 0.1412 0.1396 0.1494 0.0192 -0.1226 -0.2949 -0.2957 0.1446 0.1389 0.1356 0.1438 0.1378 0.1406
va: 4.0057 3.9908 4.0888 3.5460 4.0761 4.0089 0.9758 0.9758 0.9678 0.9790 3.9268 0.9420 0.9582 0.9598 3.7576 4.0336 4.0293 3.9580 0.9705 3.9804 0.9731 3.9714 0.9663 0.9674 0.9600 3.6974 3.2534 3.8935 3.8918 0.9692 0.9517 0.9513 0.9691 0.9517 0.9511
dispersion: -0.077127682 hartree
energy: -675.568878009529 hartree
dipole: -2.447800793 2.324548444 -0.123252349 -11.466220215 13.783967904 2.317747689 -0.261156260 -0.116506699 -0.377662959
dipolemethod: SCF
magnitude: 2.351547321 au
magnitude: 5.977158277 debye
