program: Orca
programVersion: 6.1.x
elementType: C C C C C C H H C H H H C C C C H C H C H H H C C F F F C F F F N O O
charge: 1
multiplicity: 1
keywords: opt wb97x-d3bj def2-tzvp(-f) def2/J tightscf tightopt
formula: C16H10F6NO2
InChI: InChI=1/C16H10F6NO2/c17-15(18,19)12-8-11(7-6-10-4-2-1-3-5-10)9-13(16(20,21)22)14(12)23(24)25/h1-6,8-9H,7H2
35 atoms
C  -0.325423 -1.931254 0.035563
C  1.061699 -1.946267 0.107224
C  1.726441 -0.779285 0.454798
C  1.019451 0.379829 0.743379
C  -0.365562 0.376912 0.663404
C  -1.050199 -0.77689 0.309992
H  2.808165 -0.790697 0.508403
H  -0.933655 1.271296 0.890092
C  1.760677 1.653579 1.133492
H  1.34088 2.080938 2.042388
H  2.809436 1.406755 1.327088
H  2.250159 2.245841 -0.899984
C  1.062683 3.795695 -0.109291
C  1.132351 4.495271 -1.353207
C  0.316236 4.36257 0.969003
C  0.488249 5.696822 -1.510166
H  1.699684 4.060423 -2.169199
C  -0.323237 5.56133 0.79829
H  0.25544 3.847547 1.919133
C  -0.235615 6.222428 -0.436321
H  0.535239 6.232589 -2.449815
H  -0.893452 6.002172 1.606382
H  -0.746769 7.171874 -0.559813
C  1.721906 2.587483 -0.010412
C  1.886207 -3.198557 -0.168648
F  3.150497 -2.859899 -0.479237
F  1.391347 -3.895795 -1.195931
F  1.931841 -3.990064 0.904973
C  -2.569893 -0.716322 0.221531
F  -3.035148 0.310151 0.959964
F  -3.140751 -1.832427 0.677676
F  -2.969573 -0.512806 -1.03844
N  -1.049851 -3.167619 -0.348088
O  -1.584572 -3.151621 -1.431556
O  -1.034741 -4.065901 0.458023
totalener: -1420.40745427117781 hartree
nucrepener: 2264.40085502799957 hartree
electener: -3684.80834688762980 hartree
oneelecener: -6430.15633008299938 hartree
twoeener: 2745.34798319536958 hartree
kineticenergy: 1415.32340060730212 hartree
exchangeener: -117.259125092253 hartree
correlationener: -7.946500321939 hartree
xcener: -125.205625414192 hartree
dispersion: -0.083601797 hartree
dispersion: -0.083736775 hartree
dispersion: -0.083840022 hartree
dispersion: -0.084011720 hartree
dispersion: -0.083822652 hartree
dispersion: -0.083848554 hartree
dispersion: -0.083860274 hartree
dispersion: -0.083884476 hartree
dispersion: -0.083890872 hartree
dispersion: -0.083893180 hartree
dispersion: -0.083895967 hartree
energy: -677.7477 -677.6668 -677.6237 -677.5800 -677.5626 -677.4528 -526.7699 -526.7602 -401.8625 -289.7510 -289.6470 -286.8730 -285.4915 -285.4837 -285.4372 -285.4249 -285.4112 -284.9719 -284.7384 -284.7241 -284.6965 -284.5817 -284.5396 -284.2981 -284.2258 -42.5109 -42.4004 -40.5934 -40.0249 -39.9417 -39.9087 -39.8338 -35.7386 -32.9455 -32.3732 -31.2684 -29.9846 -29.5328 -29.4955 -28.5959 -27.0702 -26.4549 -26.2473 -25.4078 -25.1846 -24.4526 -24.1381 -23.8203 -22.7629 -22.6495 -22.5978 -22.4419 -22.3238 -22.0286 -21.6607 -21.5555 -21.4549 -21.2428 -20.9903 -20.3791 -20.2311 -20.1028 -19.8928 -19.8317 -19.3135 -18.9971 -18.9044 -18.8557 -18.7843 -18.6939 -18.3381 -18.2515 -18.0826 -18.0148 -17.8671 -17.8350 -17.7532 -17.5175 -17.4104 -17.2347 -17.2139 -17.1138 -16.8967 -16.2534 -15.4377 -14.8940 -14.7772 -14.3491 -14.2369 -14.0341 -13.4343 -6.6070 -3.1418 -3.0235 -2.8697 -2.2287 -1.9059 -0.9093 -0.6721 -0.3020 0.3316 0.3830 electronvolt
chargesum: 1.0000000
charge: 0.084853 0.170562 -0.417602 0.532911 -0.409897 0.170367 0.135599 0.133970 -0.394325 0.194427 0.202325 0.175490 0.400822 -0.192946 -0.218862 -0.076173 0.151365 -0.069776 0.146118 0.009246 0.153241 0.151363 0.163083 0.008790 0.472855 -0.188006 -0.172456 -0.162288 0.465936 -0.191213 -0.169282 -0.167456 0.504289 -0.301316 -0.296015
charge: -0.020398 -0.056015 -0.032832 -0.113160 -0.037763 -0.058325 0.157178 0.152650 -0.149635 0.148813 0.169793 0.167181 -0.132521 0.012216 -0.001024 -0.083981 0.158359 -0.082135 0.152843 0.016581 0.157149 0.156679 0.160679 0.122053 -0.349033 0.109575 0.130580 0.131366 -0.347991 0.104607 0.135208 0.124624 -0.009848 0.000282 0.006245
qa: 0.0849 0.1706 -0.4176 0.5329 -0.4099 0.1704 0.1356 0.1340 -0.3943 0.1944 0.2023 0.1755 0.4008 -0.1929 -0.2189 -0.0762 0.1514 -0.0698 0.1461 0.0092 0.1532 0.1514 0.1631 0.0088 0.4729 -0.1880 -0.1725 -0.1623 0.4659 -0.1912 -0.1693 -0.1675 0.5043 -0.3013 -0.2960
va: 4.1727 3.9137 3.9687 3.3466 3.9605 3.9126 0.9862 0.9821 3.9209 0.9408 0.9543 0.9553 3.7568 4.0243 4.0236 3.9634 0.9686 3.9845 0.9739 3.9523 0.9643 0.9652 0.9570 3.7127 4.4478 1.1168 1.1513 1.1572 4.4502 1.1111 1.1573 1.1469 4.2742 1.9967 2.0037
dispersion: -0.083896506 hartree
energy: -1420.492829414120 hartree
dipole: 11.102926740 -8.623417937 2.479508803 43.803694704 -35.133863317 8.669831387 2.212031844 -1.867422311 0.344609533
dipolemethod: SCF
magnitude: 9.024006644 au
magnitude: 22.937202040 debye
