program: Orca
programVersion: 6.1.x
elementType: C C C C C C H H H H C H H H C C C C H C H C H H H C O H
charge: 1
multiplicity: 1
keywords: opt wb97x-d3bj def2-tzvp(-f) def2/J tightscf tightopt
formula: C14H13O
InChI: InChI=1/C14H13O/c15-14-10-8-13(9-11-14)7-6-12-4-2-1-3-5-12/h1-6,8-11,15H,7H2
28 atoms
C  -0.611554 -3.682679 -0.038538
C  0.732825 -3.606466 -0.407731
C  1.430937 -2.432628 -0.209597
C  0.812639 -1.324201 0.371401
C  -0.533854 -1.40068 0.714808
C  -1.244761 -2.574685 0.523804
H  1.209179 -4.47918 -0.837241
H  2.478665 -2.385407 -0.48838
H  -1.036771 -0.544584 1.154646
H  -2.289543 -2.631935 0.811521
C  1.590969 -0.035279 0.595435
H  1.465581 0.331549 1.613166
H  2.655445 -0.242354 0.443475
H  1.432846 0.681391 -1.441932
C  0.440319 2.107816 -0.239819
C  0.109973 2.871933 -1.394203
C  0.025451 2.5669 1.041932
C  -0.597791 4.043912 -1.27219
H  0.426273 2.515831 -2.368756
C  -0.682992 3.736808 1.151434
H  0.267809 1.995016 1.928282
C  -0.990416 4.469949 -0.001905
H  -0.850371 4.631032 -2.14614
H  -1.003321 4.097009 2.121094
H  -1.54961 5.394708 0.095888
C  1.174288 0.941938 -0.416239
O  -1.24151 -4.858453 -0.252533
H  -2.155065 -4.81264 0.050453
totalener: -616.68230061033910 hartree
nucrepener: 862.53306773825955 hartree
electener: -1479.21536994033613 hartree
oneelecener: -2528.30557694870595 hartree
twoeener: 1049.09020700836982 hartree
kineticenergy: 613.84601651096284 hartree
exchangeener: -57.358075267988 hartree
correlationener: -4.305712285724 hartree
xcener: -61.663787553712 hartree
dispersion: -0.063246876 hartree
dispersion: -0.063529067 hartree
dispersion: -0.063564389 hartree
dispersion: -0.063568747 hartree
dispersion: -0.063564156 hartree
dispersion: -0.063563678 hartree
energy: -526.6302 -286.2802 -284.8859 -284.8687 -284.8391 -284.8097 -284.5187 -284.2131 -284.1803 -284.1566 -283.4535 -283.1567 -283.0089 -282.7741 -282.5968 -35.6009 -32.3536 -30.9910 -30.1688 -28.9928 -28.6601 -27.4494 -26.8963 -25.6425 -24.7638 -23.8238 -23.6338 -22.8225 -22.1369 -21.3966 -20.9316 -20.3951 -20.1653 -19.7075 -19.3317 -19.1129 -18.7681 -18.4290 -18.1451 -17.8712 -17.6437 -17.5281 -17.2665 -16.7956 -16.5756 -16.2603 -15.5033 -15.3091 -14.7592 -14.3438 -12.8690 -11.7725 -5.9823 -2.6437 -1.8315 -1.4992 -0.8903 -0.3938 -0.1461 0.1603 0.4802 0.8334 0.8648 electronvolt
chargesum: 1.0000000
charge: 0.328772 -0.143050 -0.260527 0.424484 -0.269146 -0.151291 0.123092 0.108727 0.105898 0.105809 -0.383171 0.177905 0.191319 0.169336 0.404683 -0.205213 -0.223910 -0.076990 0.144231 -0.074682 0.142994 -0.004625 0.145750 0.143788 0.154503 0.024461 -0.399378 0.296230
charge: -0.175732 -0.081563 -0.088222 -0.143371 -0.093911 -0.111509 0.150223 0.143331 0.139038 0.140217 -0.164906 0.144485 0.167235 0.165329 -0.136199 0.000463 -0.008850 -0.089789 0.155741 -0.088627 0.151390 -0.002601 0.153990 0.153472 0.157123 0.128093 0.047763 0.187386
qa: 0.3288 -0.1430 -0.2605 0.4245 -0.2691 -0.1513 0.1231 0.1087 0.1059 0.1058 -0.3832 0.1779 0.1913 0.1693 0.4047 -0.2052 -0.2239 -0.0770 0.1442 -0.0747 0.1430 -0.0046 0.1458 0.1438 0.1545 0.0245 -0.3994 0.2962
va: 4.0930 3.9424 4.0628 3.5617 4.1146 3.8938 0.9793 0.9719 0.9660 0.9753 3.9271 0.9431 0.9556 0.9574 3.7497 4.0278 4.0253 3.9594 0.9699 3.9792 0.9747 3.9648 0.9657 0.9666 0.9589 3.6943 2.1308 0.9312
dispersion: -0.063563301 hartree
energy: -616.746735836615 hartree
dipole: 0.900466753 -0.994816945 -0.094350192 4.499932129 -1.579275672 2.920656458 0.754929908 -0.816830403 -0.061900495
dipolemethod: SCF
magnitude: 2.922835571 au
magnitude: 7.429257608 debye
