program: Orca
programVersion: 6.1.x
elementType: C C C C C C H H H H C H H H C C C C H C H C H H H C C C H
charge: 1
multiplicity: 1
keywords: opt wb97x-d3bj def2-tzvp(-f) def2/J tightscf tightopt
formula: C16H13
InChI: InChI=1/C16H13/c1-2-14-8-10-16(11-9-14)13-12-15-6-4-3-5-7-15/h1,3-12H,13H2
29 atoms
C  -0.284352 -3.480251 0.108749
C  0.96145 -3.318986 -0.50235
C  1.606025 -2.094912 -0.456844
C  1.023914 -1.020784 0.210614
C  -0.225375 -1.171626 0.806452
C  -0.872627 -2.395648 0.764586
H  1.420151 -4.161155 -1.005636
H  2.578193 -1.983528 -0.925486
H  -0.692126 -0.337526 1.321638
H  -1.837843 -2.522094 1.239254
C  1.739405 0.324298 0.266324
H  1.787501 0.700066 1.287166
H  2.76459 0.187794 -0.09338
H  1.124318 0.981367 -1.70484
C  0.31175 2.374821 -0.343095
C  -0.293797 3.089479 -1.416427
C  0.132688 2.838086 0.992112
C  -1.039599 4.216005 -1.16666
H  -0.156308 2.730418 -2.430721
C  -0.615998 3.962316 1.22919
H  0.58561 2.304363 1.817586
C  -1.196932 4.646002 0.152693
H  -1.501728 4.764912 -1.977453
H  -0.759532 4.325103 2.2393
H  -1.786331 5.535225 0.351354
C  1.062415 1.250732 -0.650993
C  -0.954718 -4.749266 0.064615
C  -1.514274 -5.808019 0.02626
H  -2.010033 -6.752126 -0.005807
totalener: -617.61014233487288 hartree
nucrepener: 899.20314240026903 hartree
electener: -1516.81331721859988 hartree
oneelecener: -2599.31697010375592 hartree
twoeener: 1082.50365288515604 hartree
kineticenergy: 614.63765682772407 hartree
exchangeener: -58.580094258512 hartree
correlationener: -4.436355287513 hartree
xcener: -63.016449546025 hartree
dispersion: -0.067494287 hartree
dispersion: -0.067834553 hartree
dispersion: -0.067882294 hartree
dispersion: -0.067903274 hartree
dispersion: -0.067917075 hartree
dispersion: -0.067918627 hartree
dispersion: -0.067921454 hartree
dispersion: -0.067922075 hartree
dispersion: -0.067922627 hartree
energy: -286.3947 -285.0020 -284.9927 -284.9519 -284.9219 -284.3074 -284.2848 -284.2748 -283.7127 -283.4489 -283.1105 -283.0221 -282.8932 -282.8621 -282.0729 -281.9255 -32.4608 -31.1523 -30.4006 -29.1219 -28.9668 -27.6759 -27.4452 -26.3837 -25.6601 -24.8674 -23.8253 -23.5067 -23.0508 -22.2352 -21.3157 -21.0645 -20.4971 -19.9136 -19.8626 -19.4431 -19.3958 -19.0294 -18.6849 -18.4342 -17.9506 -17.8865 -17.6022 -17.3095 -16.9586 -16.6759 -16.1533 -15.6200 -14.9185 -14.4453 -14.1986 -13.0087 -12.8651 -11.8138 -6.1002 -2.7297 -2.1939 -1.6360 -1.4013 -0.4639 -0.2387 0.0947 0.7104 0.7702 1.0831 electronvolt
chargesum: 1.0000000
charge: 0.154856 -0.214186 -0.253443 0.410540 -0.245562 -0.216913 0.129372 0.109657 0.106476 0.125151 -0.388462 0.181507 0.192967 0.170398 0.402708 -0.200063 -0.222364 -0.078113 0.146017 -0.073778 0.144559 -0.000172 0.147347 0.145582 0.156356 0.025619 -0.006875 -0.036849 0.187666
charge: -0.115215 -0.051550 -0.090993 -0.127411 -0.094914 -0.056065 0.151974 0.143100 0.138947 0.150384 -0.158943 0.145701 0.167990 0.166081 -0.135015 0.003853 -0.005757 -0.088623 0.156389 -0.087087 0.152031 0.002258 0.154660 0.154219 0.157921 0.128586 -0.062725 -0.019764 0.119967
qa: 0.1549 -0.2142 -0.2534 0.4105 -0.2456 -0.2169 0.1294 0.1097 0.1065 0.1252 -0.3885 0.1815 0.1930 0.1704 0.4027 -0.2001 -0.2224 -0.0781 0.1460 -0.0738 0.1446 -0.0002 0.1473 0.1456 0.1564 0.0256 -0.0069 -0.0368 0.1877
va: 3.9106 3.9665 4.0005 3.6332 4.0024 3.9833 0.9744 0.9734 0.9669 0.9763 3.9330 0.9433 0.9556 0.9571 3.7532 4.0265 4.0266 3.9614 0.9695 3.9810 0.9743 3.9611 0.9654 0.9663 0.9585 3.6955 3.4717 3.3591 0.9764
dispersion: -0.067921186 hartree
energy: -617.679013189979 hartree
dipole: 1.446087300 -1.196004293 0.250083007 6.024832665 -2.529861926 3.494970740 0.038407286 -0.403953568 -0.365546282
dipolemethod: SCF
magnitude: 3.522922943 au
magnitude: 8.954558491 debye
