program: Orca
programVersion: 6.1.x
elementType: C C C C C C H H H H C H H H C C C C H C H C H H H C C C C H H H H H
charge: 1
multiplicity: 1
keywords: opt wb97x-d3bj def2-tzvp(-f) def2/J tightscf tightopt
formula: C17H17
InChI: InChI=1/C17H17/c1-2-4-14(5-3-1)6-7-15-8-10-16(11-9-15)17-12-13-17/h1-5,7-11,17H,6,12-13H2
34 atoms
C  -0.038353 -3.072717 -0.266058
C  0.292568 -2.612381 1.030221
C  0.714666 -1.330439 1.21643
C  0.836836 -0.423768 0.11502
C  0.49775 -0.901738 -1.19019
C  0.074374 -2.184102 -1.365269
H  0.209552 -3.27922 1.878878
H  0.966352 -0.976414 2.210545
H  0.576384 -0.241014 -2.044026
H  -0.181968 -2.543993 -2.354517
C  1.271723 0.856308 0.358828
H  1.487831 1.110275 1.395596
H  2.428715 2.392116 -0.4627
H  1.338137 1.64688 -1.634518
C  0.395236 3.039984 -0.268063
C  -0.949906 2.82166 -0.551463
C  0.790745 4.230212 0.334373
C  -1.8895 3.800259 -0.256699
H  -1.26633 1.892135 -1.015746
C  -0.149778 5.207046 0.630296
H  1.838748 4.40412 0.556159
C  -1.489751 4.993212 0.334252
H  -2.934611 3.632661 -0.489836
H  0.165675 6.138201 1.086375
H  -2.224123 5.757042 0.561998
C  1.428378 1.969439 -0.598185
C  -0.49241 -4.433553 -0.508804
C  0.059522 -5.581561 0.336085
C  -1.337797 -5.153637 0.541251
H  -0.715092 -4.665017 -1.542195
H  0.801989 -5.326688 1.08156
H  0.249981 -6.500334 -0.202971
H  -2.135028 -5.770054 0.14692
H  -1.591212 -4.594916 1.433241
totalener: -658.22673909869900 hartree
nucrepener: 1037.80971020444395 hartree
electener: -1696.03644567296419 hartree
oneelecener: -2928.76149259724070 hartree
twoeener: 1232.72504692427651 hartree
kineticenergy: 654.97500853917222 hartree
exchangeener: -62.831197943631 hartree
correlationener: -4.836371255036 hartree
xcener: -67.667569198668 hartree
dispersion: -0.075824561 hartree
dispersion: -0.076222810 hartree
dispersion: -0.076284062 hartree
dispersion: -0.076318861 hartree
dispersion: -0.076320321 hartree
dispersion: -0.076318368 hartree
dispersion: -0.076316274 hartree
dispersion: -0.076316030 hartree
dispersion: -0.076316005 hartree
dispersion: -0.076315673 hartree
energy: -285.6005 -285.1548 -284.6047 -284.5651 -284.4074 -283.9207 -283.9204 -283.7858 -283.7505 -283.3744 -283.3661 -283.2185 -282.6645 -282.5830 -282.4553 -282.4149 -282.3793 -32.1912 -31.2648 -30.5434 -29.7798 -28.7898 -28.3780 -26.9814 -26.8466 -25.7052 -24.5681 -23.8316 -23.4865 -23.0804 -22.9692 -22.3877 -21.4539 -21.1410 -20.3329 -20.0665 -19.7821 -19.5467 -19.0727 -18.9862 -18.5499 -18.2200 -18.1009 -17.9788 -17.4879 -17.3720 -16.9220 -16.8732 -16.5022 -16.4406 -16.0400 -15.7479 -15.1830 -15.1117 -14.9519 -14.2102 -13.4148 -12.4222 -12.3105 -5.5490 -2.3473 -1.6437 -1.1575 -0.8246 -0.1228 -0.0037 0.3489 0.4479 0.7771 0.9706 electronvolt
chargesum: 1.0000000
charge: 0.463245 -0.236759 -0.233593 0.404697 -0.185478 -0.299054 0.142896 0.136244 0.135508 0.128236 -0.005101 0.161105 0.183170 0.170016 0.427488 -0.256202 -0.271872 -0.078005 0.100318 -0.070960 0.104161 -0.086880 0.111424 0.116344 0.117403 -0.369839 -0.173737 -0.138202 -0.137529 0.114171 0.126450 0.137235 0.137019 0.126081
charge: -0.011128 -0.076225 -0.003615 -0.140168 -0.008857 -0.068049 0.152472 0.155266 0.151676 0.152970 0.093185 0.161975 0.162390 0.142656 -0.131751 -0.101824 -0.098105 -0.107748 0.136060 -0.103500 0.140036 -0.100859 0.140923 0.142693 0.142464 -0.160584 -0.143188 -0.147655 -0.148027 0.148805 0.128308 0.135635 0.135581 0.128186
qa: 0.4632 -0.2368 -0.2336 0.4047 -0.1855 -0.2991 0.1429 0.1362 0.1355 0.1282 -0.0051 0.1611 0.1832 0.1700 0.4275 -0.2562 -0.2719 -0.0780 0.1003 -0.0710 0.1042 -0.0869 0.1114 0.1163 0.1174 -0.3698 -0.1737 -0.1382 -0.1375 0.1142 0.1265 0.1372 0.1370 0.1261
va: 3.7104 3.9019 4.0208 3.7712 3.8911 4.0004 0.9764 0.9756 0.9784 0.9758 3.7390 0.9583 0.9563 0.9467 3.6147 4.0619 4.0701 3.9834 0.9650 3.9703 0.9721 3.9989 0.9692 0.9677 0.9663 3.9194 3.8177 3.8642 3.8643 0.9555 0.9741 0.9815 0.9815 0.9742
dispersion: -0.076314187 hartree
energy: -658.304023749780 hartree
dipole: -0.864934017 1.420025343 0.555091326 -7.052783416 5.310980115 -1.741803301 0.616900636 -0.493547334 0.123353302
dipolemethod: SCF
magnitude: 1.832272130 au
magnitude: 4.657265635 debye
