program: Orca
programVersion: 6.1.x
elementType: C C C C C C H H H C H H H C C C C H C H C H H H C H C O H
charge: 1
multiplicity: 1
keywords: opt wb97x-d3bj def2-tzvp(-f) def2/J tightscf tightopt
formula: C15H13O
InChI: InChI=1/C15H13O/c16-12-15-8-4-7-14(11-15)10-9-13-5-2-1-3-6-13/h1-8,10-12H,9H2
29 atoms
C  -0.727438 -3.442921 -0.732186
C  0.181853 -3.207879 0.308691
C  0.790793 -1.980863 0.404165
C  0.502731 -0.960298 -0.546053
C  -0.425349 -1.229923 -1.591677
C  -1.031133 -2.461017 -1.677185
H  1.496667 -1.777845 1.204678
H  -0.655609 -0.463711 -2.320882
H  -1.737645 -2.672312 -2.470101
C  1.146588 0.262253 -0.413569
H  1.82909 0.362614 0.429781
H  1.978657 1.831029 -1.49805
H  0.420293 1.297947 -2.140118
C  0.307367 2.541787 -0.3647
C  -1.04179 2.424661 -0.042335
C  1.048847 3.617496 0.115416
C  -1.654627 3.401687 0.730835
H  -1.622248 1.582352 -0.407178
C  0.433946 4.591135 0.888718
H  2.101125 3.708357 -0.133292
C  -0.916862 4.483496 1.19663
H  -2.708357 3.318411 0.969743
H  1.008438 5.437675 1.245982
H  -1.397116 5.245454 1.799327
C  0.980548 1.474078 -1.223246
H  -1.194158 -4.422253 -0.782287
C  0.46886 -4.301105 1.297868
O  -0.057891 -5.376181 1.229075
H  1.196279 -4.050919 2.092876
totalener: -654.79595876154815 hartree
nucrepener: 932.11531417061508 hartree
electener: -1586.91129579949734 hartree
oneelecener: -2716.61785195843368 hartree
twoeener: 1129.70655615893634 hartree
kineticenergy: 651.79300001971501 hartree
exchangeener: -60.863932308569 hartree
correlationener: -4.552478702974 hartree
xcener: -65.416411011543 hartree
dispersion: -0.067058596 hartree
dispersion: -0.067363370 hartree
dispersion: -0.067406404 hartree
dispersion: -0.067474555 hartree
dispersion: -0.067426099 hartree
dispersion: -0.067430043 hartree
dispersion: -0.067443614 hartree
dispersion: -0.067447584 hartree
dispersion: -0.067448557 hartree
dispersion: -0.067447192 hartree
energy: -526.5862 -286.6046 -285.7912 -285.3043 -285.2538 -285.1708 -285.1631 -284.5804 -284.5098 -284.4073 -283.7726 -283.1462 -283.0458 -282.8704 -282.8344 -282.8063 -36.0528 -32.7193 -31.2599 -30.4351 -29.5246 -28.9945 -27.4293 -27.2406 -26.1506 -25.3851 -24.7040 -23.4410 -23.0650 -22.7280 -22.1783 -21.3586 -20.8393 -20.7392 -20.0496 -19.7073 -19.5470 -19.0337 -18.8661 -18.7901 -18.6990 -18.0175 -17.8879 -17.6407 -17.5550 -17.3927 -17.2299 -16.5181 -15.7555 -15.5567 -14.9922 -14.5679 -13.8005 -12.8569 -12.7920 -6.2866 -3.6916 -2.4282 -1.6123 -1.3866 -0.6095 -0.5160 -0.3617 0.1828 0.5646 0.6654 electronvolt
chargesum: 1.0000000
charge: -0.131085 0.363676 -0.366089 0.432816 -0.211639 -0.044507 0.145500 0.146852 0.148027 0.027943 0.170998 0.194621 0.179515 0.420788 -0.249155 -0.264738 -0.081407 0.105372 -0.071974 0.109124 -0.080933 0.117830 0.122183 0.123550 -0.378911 0.179148 0.159876 -0.370704 0.103322
charge: 0.051345 -0.123567 0.030037 -0.133002 0.007921 -0.080659 0.158820 0.153846 0.156254 0.132626 0.166736 0.169053 0.145737 -0.129541 -0.099522 -0.094985 -0.102868 0.137000 -0.098088 0.141672 -0.092614 0.143325 0.144950 0.144880 -0.158463 0.167863 -0.124092 0.061518 0.123816
qa: -0.1311 0.3637 -0.3661 0.4328 -0.2116 -0.0445 0.1455 0.1469 0.1480 0.0279 0.1710 0.1946 0.1795 0.4208 -0.2492 -0.2647 -0.0814 0.1054 -0.0720 0.1091 -0.0809 0.1178 0.1222 0.1236 -0.3789 0.1791 0.1599 -0.3707 0.1033
va: 3.9481 3.5772 3.9563 3.7193 4.0057 3.8839 0.9774 0.9738 0.9675 3.6885 0.9576 0.9538 0.9435 3.6046 4.0621 4.0717 3.9983 0.9637 3.9776 0.9714 3.9976 0.9690 0.9673 0.9656 3.9179 0.9732 3.9946 2.1348 0.9627
dispersion: -0.067445919 hartree
energy: -654.864142504531 hartree
dipole: 0.637205992 0.055355817 0.692561809 9.549365778 -9.291306647 0.258059131 -1.740878362 0.889688428 -0.851189934
dipolemethod: SCF
magnitude: 1.127280212 au
magnitude: 2.865318590 debye
