program: Orca
programVersion: 6.1.x
elementType: C C C C C C H H H C H H H C C C C H C H C H H H C O H O H
charge: 1
multiplicity: 1
keywords: opt wb97x-d3bj def2-tzvp(-f) def2/J tightscf tightopt
formula: C14H13O2
InChI: InChI=1/C14H13O2/c15-13-9-8-12(10-14(13)16)7-6-11-4-2-1-3-5-11/h1-5,7-10,15-16H,6H2
29 atoms
C  0.106118 -3.549768 0.444454
C  1.203005 -2.978793 1.109924
C  1.562184 -1.700135 0.803865
C  0.848245 -0.938544 -0.176403
C  -0.272247 -1.543591 -0.842438
C  -0.631961 -2.814317 -0.53981
H  1.728955 -3.572579 1.846526
H  2.404416 -1.237334 1.305855
H  -0.828658 -0.984801 -1.585145
C  1.272427 0.339144 -0.431963
H  2.125987 0.693291 0.143018
H  1.483712 1.721402 -1.989318
H  -0.08415 0.911867 -1.995044
C  0.123129 2.485516 -0.519261
C  -1.016272 2.294259 0.25731
C  0.757914 3.723455 -0.520649
C  -1.529814 3.342372 1.00886
H  -1.513016 1.328306 0.269056
C  0.244489 4.770648 0.232182
H  1.646156 3.876931 -1.124914
C  -0.899661 4.581341 0.996138
H  -2.423165 3.193206 1.604195
H  0.735713 5.736592 0.216963
H  -1.30248 5.399431 1.581811
C  0.683392 1.337467 -1.349365
O  -0.245618 -4.778209 0.732702
H  -1.014753 -5.043577 0.199217
O  -1.655838 -3.526985 -1.071692
H  -2.13561 -3.031612 -1.744989
totalener: -691.96053320633052 hartree
nucrepener: 977.55328680201819 hartree
electener: -1669.51382998989766 hartree
oneelecener: -2859.94315354339096 hartree
twoeener: 1190.42932355349330 hartree
kineticenergy: 688.89805214557589 hartree
exchangeener: -63.174382883427 hartree
correlationener: -4.676738013784 hartree
xcener: -67.851120897211 hartree
dispersion: -0.065602100 hartree
dispersion: -0.065871746 hartree
dispersion: -0.065913923 hartree
dispersion: -0.065925068 hartree
dispersion: -0.065927813 hartree
dispersion: -0.065934574 hartree
dispersion: -0.065943775 hartree
dispersion: -0.065957967 hartree
dispersion: -0.065962398 hartree
dispersion: -0.065967231 hartree
energy: -528.8540 -528.4120 -286.9777 -286.1485 -285.5878 -284.9028 -284.7295 -284.6641 -284.1960 -283.8757 -283.2723 -282.7375 -282.6388 -282.5227 -282.4727 -282.4361 -38.2458 -37.1089 -32.1955 -30.7095 -29.9253 -29.0450 -28.4506 -27.0446 -26.8272 -25.9184 -25.5399 -23.6762 -23.2966 -23.0963 -22.8625 -22.4316 -21.2794 -20.5288 -20.4164 -20.0889 -19.8723 -19.6358 -19.0173 -18.7948 -18.5190 -18.1456 -18.0991 -17.7857 -17.7038 -17.4964 -17.0622 -16.9645 -16.9383 -16.1101 -15.3122 -15.1769 -14.2476 -13.4845 -12.4860 -12.3696 -5.5280 -2.3725 -1.5568 -1.2356 -1.0744 -0.8229 -0.2365 -0.0247 0.3382 0.6966 0.8391 electronvolt
chargesum: 1.0000000
charge: 0.328686 -0.164227 -0.188173 0.391442 -0.305771 0.320266 0.147096 0.143058 0.130039 -0.001960 0.160367 0.181655 0.159837 0.430261 -0.257910 -0.276258 -0.077696 0.095395 -0.067431 0.104304 -0.089011 0.111308 0.117266 0.117889 -0.361101 -0.346619 0.339925 -0.457709 0.315071
charge: -0.082750 -0.073037 0.002549 -0.142542 -0.025942 -0.175579 0.160928 0.158625 0.150345 0.079841 0.162376 0.162023 0.140150 -0.132981 -0.104219 -0.097909 -0.107979 0.134468 -0.102762 0.140186 -0.100750 0.140863 0.142947 0.142674 -0.160950 0.138949 0.215421 0.035288 0.199767
qa: 0.3287 -0.1642 -0.1882 0.3914 -0.3058 0.3203 0.1471 0.1431 0.1300 -0.0020 0.1604 0.1817 0.1598 0.4303 -0.2579 -0.2763 -0.0777 0.0954 -0.0674 0.1043 -0.0890 0.1113 0.1173 0.1179 -0.3611 -0.3466 0.3399 -0.4577 0.3151
va: 4.1276 3.9368 3.9563 3.8228 3.9034 3.8633 0.9762 0.9718 0.9930 3.7325 0.9597 0.9552 0.9477 3.6139 4.0571 4.0691 3.9846 0.9645 3.9658 0.9719 4.0014 0.9692 0.9675 0.9663 3.9362 2.2568 0.9113 2.0647 0.9266
dispersion: -0.065966670 hartree
energy: -692.027371756571 hartree
dipole: 0.752889271 -0.520780787 0.232108484 8.972882617 -10.490749685 -1.517867068 -1.140211566 0.528005667 -0.612205899
dipolemethod: SCF
magnitude: 1.653055004 au
magnitude: 4.201731903 debye
