program: Orca
programVersion: 6.1.x
elementType: C C C C C C H H H H C H H H C C C C H C H C H H H C N C C H H H H H H
charge: 1
multiplicity: 1
keywords: opt wb97x-d3bj def2-tzvp(-f) def2/J tightscf tightopt
formula: C16H18N
InChI: InChI=1/C16H18N/c1-17(2)16-12-10-15(11-13-16)9-8-14-6-4-3-5-7-14/h3-7,9-13H,8H2,1-2H3
35 atoms
C  -0.00425 -3.071697 0.043682
C  0.979713 -2.515606 0.935929
C  1.37877 -1.233896 0.794018
C  0.853084 -0.37426 -0.237467
C  -0.135059 -0.944546 -1.118586
C  -0.546582 -2.223237 -0.989694
H  1.401337 -3.123725 1.722195
H  2.120133 -0.8251 1.472386
H  -0.561849 -0.333898 -1.904008
H  -1.289619 -2.61387 -1.668973
C  1.29949 0.90681 -0.331298
H  2.038667 1.225412 0.401572
H  1.757744 2.377387 -1.761196
H  0.212063 1.583831 -2.060246
C  0.177776 3.068819 -0.486372
C  -1.076007 2.847726 0.076686
C  0.8015 4.299335 -0.308778
C  -1.70649 3.854691 0.794486
H  -1.568752 1.888313 -0.052754
C  0.172171 5.306456 0.411082
H  1.777793 4.479071 -0.747557
C  -1.082853 5.085892 0.961922
H  -2.687258 3.680222 1.22197
H  0.660762 6.265947 0.535532
H  -1.577026 5.872328 1.520508
C  0.866641 1.966598 -1.277785
N  -0.402226 -4.32691 0.167316
C  0.145991 -5.192059 1.219894
C  -1.403579 -4.897539 -0.743148
H  -0.316779 -6.171312 1.143357
H  1.224611 -5.306803 1.099965
H  -0.07175 -4.781172 2.207124
H  -1.57306 -5.93458 -0.469642
H  -2.348935 -4.3583 -0.662375
H  -1.048764 -4.864517 -1.774523
totalener: -675.52395084189084 hartree
nucrepener: 1070.99958709172483 hartree
electener: -1746.52356908288016 hartree
oneelecener: -3018.93816125314834 hartree
twoeener: 1272.41459217026818 hartree
kineticenergy: 672.20889182587780 hartree
exchangeener: -64.057457456524 hartree
correlationener: -4.921713350984 hartree
xcener: -68.979170807508 hartree
dispersion: -0.076514225 hartree
dispersion: -0.076863983 hartree
dispersion: -0.076899921 hartree
dispersion: -0.076911951 hartree
dispersion: -0.076909401 hartree
dispersion: -0.076908220 hartree
dispersion: -0.076908109 hartree
dispersion: -0.076908399 hartree
dispersion: -0.076907404 hartree
energy: -397.9270 -285.8566 -284.6842 -284.2894 -284.2780 -284.2494 -284.2445 -283.9185 -283.7937 -283.7198 -283.2982 -282.7897 -282.3063 -282.2282 -282.1484 -282.1004 -282.0597 -34.5864 -31.4798 -30.1823 -29.4036 -28.7176 -28.0810 -27.4667 -26.8841 -26.6422 -25.6886 -24.4226 -23.9780 -22.9882 -22.6398 -22.0526 -21.8300 -20.9435 -20.2969 -20.2822 -19.9793 -19.5678 -19.1160 -19.0071 -18.6184 -18.2579 -18.1918 -17.9967 -17.7671 -17.6880 -17.4970 -17.2651 -17.1331 -17.0112 -16.5165 -16.0358 -15.6661 -15.5187 -14.8578 -14.7752 -14.1584 -12.7062 -12.0961 -11.9241 -4.7509 -2.0582 -1.0910 -0.8338 -0.4087 -0.4004 0.2266 0.2769 0.5828 0.7067 0.8192 electronvolt
chargesum: 1.0000000
charge: 0.389145 -0.190342 -0.260473 0.425146 -0.267970 -0.191408 0.137801 0.129974 0.126798 0.135466 -0.027187 0.148660 0.171880 0.158309 0.432516 -0.260873 -0.277043 -0.076040 0.093472 -0.069346 0.099890 -0.092138 0.105846 0.112006 0.112545 -0.359390 -0.083337 -0.308167 -0.308044 0.162518 0.167201 0.166554 0.163608 0.165907 0.166516
charge: -0.069131 -0.098770 -0.015915 -0.147367 -0.020809 -0.093717 0.150223 0.155068 0.151279 0.150109 0.045010 0.157081 0.156294 0.139092 -0.133221 -0.104553 -0.100535 -0.112051 0.134559 -0.107593 0.138771 -0.107499 0.138867 0.140960 0.140564 -0.163302 0.128727 -0.195933 -0.196370 0.123429 0.123490 0.123348 0.123600 0.123042 0.123252
qa: 0.3891 -0.1903 -0.2605 0.4251 -0.2680 -0.1914 0.1378 0.1300 0.1268 0.1355 -0.0272 0.1487 0.1719 0.1583 0.4325 -0.2609 -0.2770 -0.0760 0.0935 -0.0693 0.0999 -0.0921 0.1058 0.1120 0.1125 -0.3594 -0.0833 -0.3082 -0.3080 0.1625 0.1672 0.1666 0.1636 0.1659 0.1665
va: 3.9768 3.9338 4.0317 3.7107 4.0336 3.9654 0.9732 0.9771 0.9832 0.9742 3.7628 0.9613 0.9574 0.9492 3.6282 4.0577 4.0650 3.9751 0.9662 3.9628 0.9724 3.9999 0.9694 0.9679 0.9667 3.9183 3.4090 3.8474 3.8469 0.9672 0.9496 0.9498 0.9668 0.9499 0.9499
dispersion: -0.076905968 hartree
energy: -675.601845039010 hartree
dipole: -1.825248545 2.030121019 0.204872474 -11.119717064 7.756340089 -3.363376974 0.248043887 -0.256531057 -0.008487170
dipolemethod: SCF
magnitude: 3.369621557 au
magnitude: 8.564897333 debye
