program: Orca
programVersion: 6.1.x
elementType: C C C C C C H H C H H H C C C C H C H C H H H C N O O C N C N
charge: 1
multiplicity: 1
keywords: opt wb97x-d3bj def2-tzvp(-f) def2/J tightscf tightopt
formula: C16H10N3O2
InChI: InChI=1/C16H10N3O2/c17-10-14-8-13(7-6-12-4-2-1-3-5-12)9-15(11-18)16(14)19(20)21/h1-5,7-9H,6H2
31 atoms
C  0.009579 -2.522039 -0.018158
C  0.127992 -2.073496 1.298645
C  0.5525 -0.774979 1.509717
C  0.862852 0.066221 0.41434
C  0.734388 -0.42496 -0.907222
C  0.30428 -1.717539 -1.125615
H  0.646318 -0.403289 2.524038
H  0.966774 0.200108 -1.759332
C  1.296128 1.371019 0.687686
H  1.350233 1.650513 1.739546
H  2.552575 2.895177 0.055687
H  1.732553 2.076356 -1.280504
C  0.513524 3.496666 -0.176986
C  -0.740026 3.240775 -0.727039
C  0.763929 4.700076 0.477819
C  -1.729098 4.213075 -0.663622
H  -0.942499 2.298027 -1.226608
C  -0.227785 5.666427 0.539965
H  1.738793 4.894065 0.912588
C  -1.473281 5.422567 -0.028662
H  -2.699402 4.02525 -1.10774
H  -0.027316 6.61321 1.02733
H  -2.247295 6.179408 0.021228
C  1.610407 2.433406 -0.258873
N  -0.448978 -3.902987 -0.255387
O  0.415399 -4.741848 -0.236607
O  -1.633511 -4.024396 -0.440375
C  -0.189469 -2.935843 2.405408
N  -0.443873 -3.613916 3.295839
C  0.163498 -2.227333 -2.463754
N  0.056515 -2.619947 -3.536978
totalener: -930.53669908051529 hartree
nucrepener: 1429.43505232972370 hartree
electener: -2359.97175636402517 hartree
oneelecener: -4076.34792608918815 hartree
twoeener: 1716.37616972516321 hartree
kineticenergy: 926.71190707310404 hartree
exchangeener: -83.353583712262 hartree
correlationener: -5.988140267376 hartree
xcener: -89.341723979638 hartree
dispersion: -0.079400105 hartree
dispersion: -0.079712307 hartree
dispersion: -0.079756002 hartree
dispersion: -0.079921373 hartree
dispersion: -0.079797414 hartree
dispersion: -0.079768411 hartree
dispersion: -0.079742515 hartree
dispersion: -0.079742017 hartree
dispersion: -0.079744677 hartree
dispersion: -0.079739847 hartree
dispersion: -0.079732062 hartree
dispersion: -0.079725755 hartree
dispersion: -0.079691214 hartree
dispersion: -0.079715839 hartree
dispersion: -0.079723142 hartree
dispersion: -0.079720315 hartree
dispersion: -0.079717053 hartree
dispersion: -0.079714796 hartree
dispersion: -0.079715474 hartree
dispersion: -0.079721022 hartree
dispersion: -0.079721433 hartree
dispersion: -0.079722276 hartree
dispersion: -0.079722456 hartree
dispersion: -0.079723361 hartree
dispersion: -0.079723452 hartree
energy: -528.2909 -528.2882 -403.3519 -396.4991 -396.4672 -287.5901 -287.5882 -286.6106 -286.5832 -286.4306 -286.3925 -286.1857 -285.0798 -284.7642 -284.7327 -284.3910 -283.6851 -283.5540 -283.3266 -283.2977 -283.2809 -42.1144 -37.3139 -34.2596 -32.7763 -32.6920 -32.2067 -31.3307 -30.9470 -30.2533 -28.7640 -27.9254 -27.4329 -27.2736 -25.9112 -25.7569 -24.0077 -23.7168 -23.5531 -23.1549 -22.9431 -22.3000 -21.8465 -21.6418 -21.5804 -21.2772 -20.5432 -20.2350 -19.9523 -19.6798 -19.4560 -18.9653 -18.5218 -18.3893 -18.0777 -17.8848 -17.3002 -17.0991 -17.0298 -16.9829 -16.5675 -16.3830 -16.2318 -16.1063 -16.0386 -15.6977 -15.6388 -15.0038 -14.9603 -13.3342 -13.2838 -7.2155 -4.7690 -3.6930 -3.5843 -2.1045 -1.8783 -1.3745 -1.1429 -0.9411 -0.7305 -0.6014 electronvolt
chargesum: 1.0000000
charge: -0.042481 0.541183 -0.376981 0.518695 -0.420129 0.571725 0.170680 0.171746 0.002177 0.186177 0.206172 0.186956 0.413451 -0.241305 -0.263753 -0.086224 0.113925 -0.071767 0.115858 -0.072422 0.125176 0.128769 0.130684 -0.367278 0.521819 -0.262306 -0.264038 -0.281902 -0.032207 -0.290387 -0.032011
charge: 0.059951 -0.089680 0.067693 -0.123043 0.059816 -0.088752 0.172200 0.167625 0.159493 0.171990 0.175088 0.149123 -0.124760 -0.096258 -0.090649 -0.097079 0.137746 -0.091542 0.143769 -0.082180 0.146221 0.147601 0.147710 -0.157205 -0.008148 0.043244 0.041658 -0.085722 0.115842 -0.086509 0.114759
qa: -0.0425 0.5412 -0.3770 0.5187 -0.4201 0.5717 0.1707 0.1717 0.0022 0.1862 0.2062 0.1870 0.4135 -0.2413 -0.2638 -0.0862 0.1139 -0.0718 0.1159 -0.0724 0.1252 0.1288 0.1307 -0.3673 0.5218 -0.2623 -0.2640 -0.2819 -0.0322 -0.2904 -0.0320
va: 4.4337 3.6752 3.9119 3.5749 3.9130 3.6474 0.9697 0.9714 3.6997 0.9511 0.9488 0.9421 3.6135 4.0567 4.0755 4.0183 0.9598 3.9853 0.9705 3.9965 0.9688 0.9668 0.9648 3.9268 4.2602 2.0556 2.0543 3.8807 3.0884 3.8892 3.0900
dispersion: -0.079722514 hartree
energy: -930.617751080305 hartree
dipole: 2.760211686 -1.122795758 1.637415929 29.596093489 -25.369048360 4.227045129 1.018254368 -0.125874709 0.892379659
dipolemethod: SCF
magnitude: 4.620106373 au
magnitude: 11.743377139 debye
