program: Orca
programVersion: 6.1.x
elementType: C C C C C C H H H H C H H H C C C C H C H C H H H C N C C H H C H H C H H H H
charge: 1
multiplicity: 1
keywords: opt wb97x-d3bj def2-tzvp(-f) def2/J tightscf tightopt
formula: C18H20N
InChI: InChI=1/C18H20N/c1-2-6-16(7-3-1)8-9-17-10-12-18(13-11-17)19-14-4-5-15-19/h1-3,6-7,9-13H,4-5,8,14-15H2
39 atoms
C  0.219625 -2.376195 -0.040632
C  1.192828 -1.788041 0.844904
C  1.521278 -0.486207 0.720084
C  0.934311 0.362986 -0.289968
C  -0.041493 -0.24246 -1.165045
C  -0.388106 -1.540099 -1.049105
H  1.644061 -2.390578 1.620019
H  2.247394 -0.0477 1.396399
H  -0.505772 0.357951 -1.936976
H  -1.1128 -1.968099 -1.726917
C  1.316695 1.663754 -0.371212
H  2.05314 2.00682 0.353239
H  1.681153 3.163651 -1.799299
H  0.157385 2.317479 -2.063443
C  0.113091 3.785229 -0.474483
C  -1.116977 3.514331 0.118451
C  0.696758 5.035602 -0.299535
C  -1.763513 4.490719 0.863689
H  -1.578406 2.53921 -0.008904
C  0.051622 6.012353 0.447833
H  1.654197 5.254492 -0.761528
C  -1.179856 5.741758 1.028546
H  -2.725905 4.276941 1.314525
H  0.509215 6.987285 0.570329
H  -1.686713 6.504354 1.608448
C  0.819282 2.716599 -1.295418
N  -0.108478 -3.644533 0.065745
C  -1.148179 -4.312093 -0.748055
C  0.518494 -4.591954 1.013158
H  -2.053472 -3.705869 -0.771609
H  -0.777212 -4.440076 -1.768925
C  -1.348156 -5.653165 -0.046937
H  1.603023 -4.489871 0.982977
H  0.167145 -4.372106 2.025325
C  0.034761 -5.956438 0.529968
H  -2.081229 -5.54829 0.756503
H  -1.704473 -6.419062 -0.734565
H  0.699461 -6.331811 -0.2518
H  0.012927 -6.686806 1.337715
totalener: -753.01605162401427 hartree
nucrepener: 1270.87150999510845 hartree
electener: -2023.88757643717099 hartree
oneelecener: -3519.87526420727454 hartree
twoeener: 1495.98768777010355 hartree
kineticenergy: 749.31772747303955 hartree
exchangeener: -71.488882471989 hartree
correlationener: -5.505885097918 hartree
xcener: -76.994767569907 hartree
dispersion: -0.086835133 hartree
dispersion: -0.087220647 hartree
dispersion: -0.087262759 hartree
dispersion: -0.087282537 hartree
dispersion: -0.087284719 hartree
dispersion: -0.087287918 hartree
dispersion: -0.087292242 hartree
dispersion: -0.087294842 hartree
energy: -397.6718 -285.7289 -284.4999 -284.2657 -284.2548 -284.1202 -284.1122 -283.7955 -283.6835 -283.6071 -283.1869 -282.9974 -282.9910 -282.6930 -282.2194 -282.1458 -282.0723 -282.0254 -281.9835 -34.5597 -31.4260 -30.1801 -29.7224 -28.8025 -28.5911 -27.6444 -27.5097 -26.5625 -26.0896 -25.1807 -24.4148 -23.6517 -23.0136 -22.7567 -22.5479 -22.0162 -21.8800 -20.9275 -20.5329 -20.0428 -19.8150 -19.3133 -18.9598 -18.7555 -18.6229 -18.4733 -18.2203 -18.0624 -17.8659 -17.4603 -17.4448 -17.1513 -17.0370 -16.8596 -16.4327 -16.0478 -15.9431 -15.9150 -15.5539 -15.4749 -15.3258 -14.7635 -14.6937 -14.0549 -12.5518 -12.0172 -11.8306 -4.5783 -1.9391 -0.9902 -0.7549 -0.4103 -0.3199 0.2208 0.3577 0.6605 0.7447 0.9239 electronvolt
chargesum: 1.0000000
charge: 0.380287 -0.198599 -0.255370 0.426328 -0.262402 -0.198508 0.137124 0.128235 0.124328 0.134799 -0.034848 0.146672 0.169884 0.156841 0.434029 -0.262322 -0.277486 -0.075360 0.093004 -0.069488 0.098975 -0.092716 0.104899 0.110932 0.111464 -0.356993 -0.046889 -0.210602 -0.212759 0.147351 0.152001 -0.176870 0.148342 0.152254 -0.174967 0.128257 0.145970 0.128244 0.145959
charge: -0.069924 -0.098305 -0.018616 -0.147292 -0.023176 -0.093008 0.148846 0.154419 0.150657 0.148752 0.037499 0.156227 0.155438 0.138566 -0.133363 -0.104586 -0.101125 -0.112774 0.134563 -0.108515 0.138478 -0.108779 0.138517 0.140572 0.140158 -0.163821 0.176481 -0.165848 -0.165431 0.132076 0.134179 -0.209879 0.132533 0.134282 -0.209819 0.134422 0.136528 0.134500 0.136566
qa: 0.3803 -0.1986 -0.2554 0.4263 -0.2624 -0.1985 0.1371 0.1282 0.1243 0.1348 -0.0348 0.1467 0.1699 0.1568 0.4340 -0.2623 -0.2775 -0.0754 0.0930 -0.0695 0.0990 -0.0927 0.1049 0.1109 0.1115 -0.3570 -0.0469 -0.2106 -0.2128 0.1474 0.1520 -0.1769 0.1483 0.1523 -0.1750 0.1283 0.1460 0.1282 0.1460
va: 4.0302 3.9388 4.0076 3.7057 4.0101 3.9711 0.9701 0.9777 0.9843 0.9711 3.7666 0.9618 0.9577 0.9499 3.6283 4.0577 4.0644 3.9713 0.9666 3.9620 0.9724 3.9994 0.9693 0.9679 0.9668 3.9170 3.4060 3.9175 3.9192 0.9495 0.9495 3.9208 0.9496 0.9495 3.9191 0.9722 0.9696 0.9724 0.9698
dispersion: -0.087295424 hartree
energy: -753.104398164757 hartree
dipole: -1.826097445 2.206554483 0.380457037 -13.141920489 10.479803535 -2.662116954 0.245869505 -0.332522040 -0.086652535
dipolemethod: SCF
magnitude: 2.690561817 au
magnitude: 6.838864646 debye
