program: Orca
programVersion: 6.1.x
elementType: C C C C C C H H H C H H H C C C C H C H C H H H C H C F F F
charge: 1
multiplicity: 1
keywords: opt wb97x-d3bj def2-tzvp(-f) def2/J tightscf tightopt
formula: C15H12F3
InChI: InChI=1/C15H12F3/c16-15(17,18)14-8-4-7-13(11-14)10-9-12-5-2-1-3-6-12/h1-8,10-11H,9H2
30 atoms
C  -0.733433 -2.711703 -1.42677
C  -0.016614 -2.621091 -0.229114
C  0.601646 -1.443218 0.10394
C  0.512617 -0.323889 -0.770005
C  -0.222158 -0.439618 -1.981474
C  -0.837622 -1.626521 -2.299591
H  1.158562 -1.357247 1.029885
H  -0.298257 0.405526 -2.653314
H  -1.399849 -1.727468 -3.219295
C  1.162683 0.846589 -0.395539
H  1.688179 0.825296 0.558704
H  2.223159 2.470681 -1.144151
H  0.784119 2.087506 -2.097311
C  0.404435 3.148784 -0.241771
C  -0.98404 3.074793 -0.175247
C  1.087673 4.124021 0.479213
C  -1.6889 3.999349 0.583911
H  -1.520421 2.309374 -0.728298
C  0.380493 5.045034 1.237683
H  2.170195 4.17977 0.430411
C  -1.00686 4.982856 1.290341
H  -2.770734 3.951543 0.624422
H  0.912531 5.815545 1.783137
H  -1.558825 5.703801 1.88198
C  1.180812 2.13983 -1.084612
H  -1.219271 -3.649056 -1.679643
C  0.055877 -3.839164 0.671682
F  0.750872 -3.581016 1.785566
F  0.646339 -4.857965 0.032459
F  -1.175391 -4.233301 1.024109
totalener: -878.62207379986580 hartree
nucrepener: 1211.34964496798625 hartree
electener: -2089.97170261505835 hartree
oneelecener: -3585.52911755693867 hartree
twoeener: 1495.55741494188055 hartree
kineticenergy: 875.04048260044328 hartree
exchangeener: -76.412479675303 hartree
correlationener: -5.435890346649 hartree
xcener: -81.848370021952 hartree
dispersion: -0.068285510 hartree
dispersion: -0.068542059 hartree
dispersion: -0.068568215 hartree
dispersion: -0.068566737 hartree
dispersion: -0.068557997 hartree
dispersion: -0.068549400 hartree
dispersion: -0.068542915 hartree
dispersion: -0.068541730 hartree
dispersion: -0.068541335 hartree
dispersion: -0.068541750 hartree
dispersion: -0.068541585 hartree
dispersion: -0.068541790 hartree
dispersion: -0.068536771 hartree
dispersion: -0.068528361 hartree
dispersion: -0.068504080 hartree
dispersion: -0.068506871 hartree
dispersion: -0.068513555 hartree
dispersion: -0.068515479 hartree
dispersion: -0.068516491 hartree
dispersion: -0.068517777 hartree
energy: -678.1728 -678.0378 -678.0312 -290.1036 -286.6876 -285.3786 -285.3531 -285.2977 -285.2267 -284.9543 -284.6241 -284.4517 -283.8085 -283.1745 -283.0701 -282.8906 -282.8544 -282.8282 -42.9052 -40.4620 -40.3377 -32.8667 -31.3722 -30.5412 -29.7453 -29.1194 -27.4541 -27.3274 -26.7875 -25.9556 -25.0832 -24.1996 -23.4695 -23.0590 -22.8587 -22.8383 -22.7081 -21.7719 -21.3532 -20.7831 -20.7281 -19.8687 -19.6374 -19.3949 -19.2807 -19.0380 -18.9251 -18.7889 -18.3646 -18.2340 -18.1993 -17.9524 -17.8149 -17.7544 -17.6586 -17.3831 -16.8640 -16.5237 -15.8032 -15.5806 -15.1130 -14.7926 -12.8783 -12.8179 -6.3608 -3.1522 -2.3165 -1.6157 -1.3281 -0.5433 -0.3931 0.1266 0.5781 0.6668 0.9935 electronvolt
chargesum: 1.0000000
charge: -0.132688 0.296998 -0.366072 0.458002 -0.210166 -0.063516 0.160315 0.146956 0.148172 0.020519 0.176587 0.196049 0.180053 0.419689 -0.247128 -0.264269 -0.082012 0.105198 -0.071759 0.109779 -0.079574 0.118058 0.122772 0.124128 -0.377075 0.166453 0.476514 -0.181590 -0.174716 -0.175676
charge: 0.038299 -0.091511 0.035761 -0.130534 0.005896 -0.078679 0.163729 0.154266 0.156953 0.138677 0.168180 0.170094 0.145965 -0.129103 -0.099053 -0.094364 -0.102309 0.136981 -0.097378 0.141915 -0.091583 0.143498 0.145189 0.145098 -0.158233 0.167202 -0.350694 0.122380 0.121829 0.121530
qa: -0.1327 0.2970 -0.3661 0.4580 -0.2102 -0.0635 0.1603 0.1470 0.1482 0.0205 0.1766 0.1960 0.1801 0.4197 -0.2471 -0.2643 -0.0820 0.1052 -0.0718 0.1098 -0.0796 0.1181 0.1228 0.1241 -0.3771 0.1665 0.4765 -0.1816 -0.1747 -0.1757
va: 3.9948 3.9020 3.9150 3.6280 4.0136 3.9306 0.9832 0.9738 0.9671 3.6912 0.9552 0.9536 0.9434 3.6062 4.0624 4.0737 4.0004 0.9635 3.9797 0.9715 3.9980 0.9691 0.9672 0.9656 3.9178 0.9667 4.4243 1.1356 1.1399 1.1391
dispersion: -0.068517887 hartree
energy: -878.691712228505 hartree
dipole: -0.153519229 0.529152440 0.375633211 33.060615661 -31.537401005 1.523214655 -7.451182966 5.862077536 -1.589105430
dipolemethod: SCF
magnitude: 2.233056037 au
magnitude: 5.675977368 debye
