program: Orca
programVersion: 6.1.x
elementType: C C C C C C H H H H C H H H C C C C H C H C H H H C C C H
charge: 1
multiplicity: 1
keywords: opt wb97x-d3bj def2-tzvp(-f) def2/J tightscf tightopt
formula: C16H13
InChI: InChI=1/C16H13/c1-2-14-8-10-16(11-9-14)13-12-15-6-4-3-5-7-15/h1,3-11,13H,12H2
29 atoms
C  -0.090397 -3.541361 0.033153
C  0.439617 -3.035237 1.236311
C  0.888563 -1.744041 1.280517
C  0.828628 -0.909409 0.124411
C  0.287437 -1.444395 -1.082891
C  -0.162431 -2.733095 -1.124068
H  0.482247 -3.675212 2.108029
H  1.297111 -1.338011 2.199582
H  0.230866 -0.828536 -1.971037
H  -0.575284 -3.152408 -2.032529
C  1.301544 0.384978 0.225008
H  1.681894 0.690024 1.199054
H  2.30777 1.869179 -0.839844
H  1.054393 1.066608 -1.791623
C  0.326679 2.53275 -0.368267
C  -1.044979 2.301726 -0.421624
C  0.808247 3.751891 0.09914
C  -1.930797 3.299116 -0.036627
H  -1.426428 1.349359 -0.778058
C  -0.0788 4.746656 0.4847
H  1.877179 3.933663 0.142596
C  -1.447943 4.521002 0.416802
H  -2.998718 3.122769 -0.091148
H  0.29959 5.700755 0.832473
H  -2.140811 5.298911 0.715673
C  1.300927 1.441221 -0.799262
C  -0.559921 -4.882463 -0.020051
C  -0.956269 -6.013675 -0.065327
H  -1.308904 -7.021751 -0.105248
totalener: -617.61308332172973 hartree
nucrepener: 899.41954203869216 hartree
electener: -1517.03263745683353 hartree
oneelecener: -2599.64966613807701 hartree
twoeener: 1082.61702868124348 hartree
kineticenergy: 614.63996817183988 hartree
exchangeener: -58.579828069757 hartree
correlationener: -4.436335389383 hartree
xcener: -63.016163459141 hartree
dispersion: -0.067555385 hartree
dispersion: -0.067896152 hartree
dispersion: -0.067939815 hartree
dispersion: -0.067953804 hartree
dispersion: -0.067961198 hartree
dispersion: -0.067964869 hartree
dispersion: -0.067970002 hartree
dispersion: -0.067974544 hartree
dispersion: -0.067976952 hartree
energy: -286.0773 -285.6649 -284.8814 -284.8393 -284.7650 -284.2889 -284.2513 -284.0692 -283.7119 -283.5204 -283.4700 -282.8790 -282.7884 -282.6370 -282.6000 -282.5683 -32.4345 -31.0386 -30.3099 -29.1239 -29.0246 -27.9761 -27.1791 -26.8698 -25.7722 -24.8958 -23.7560 -23.1879 -22.7783 -22.5909 -21.4789 -20.9337 -20.5968 -20.4437 -19.7269 -19.3823 -19.3071 -18.7611 -18.5050 -18.4107 -17.9420 -17.7038 -17.5794 -17.1725 -16.8697 -16.2702 -16.0341 -15.3805 -15.3075 -14.5015 -14.4335 -13.6482 -12.6135 -12.5175 -6.0839 -2.6271 -2.3074 -1.3620 -1.0923 -0.3646 -0.3081 -0.0166 0.3167 0.4953 0.8468 electronvolt
chargesum: 1.0000000
charge: 0.181561 -0.190893 -0.201799 0.401635 -0.220601 -0.189580 0.149687 0.143579 0.141942 0.148738 0.005756 0.167534 0.188530 0.174484 0.423258 -0.253001 -0.270373 -0.079702 0.103690 -0.071141 0.106716 -0.083787 0.114558 0.119097 0.120232 -0.371640 0.000186 0.030421 0.210912
charge: -0.042213 -0.047784 0.002287 -0.135427 -0.006103 -0.045911 0.159955 0.157205 0.153157 0.159641 0.114133 0.164613 0.165852 0.144261 -0.130512 -0.100415 -0.096499 -0.105293 0.136695 -0.100850 0.140849 -0.096793 0.142112 0.143762 0.143602 -0.159502 -0.046337 0.053972 0.131543
qa: 0.1816 -0.1909 -0.2018 0.4016 -0.2206 -0.1896 0.1497 0.1436 0.1419 0.1487 0.0058 0.1675 0.1885 0.1745 0.4233 -0.2530 -0.2704 -0.0797 0.1037 -0.0711 0.1067 -0.0838 0.1146 0.1191 0.1202 -0.3716 0.0002 0.0304 0.2109
va: 3.9443 3.9136 3.9527 3.8018 3.9503 3.9320 0.9708 0.9714 0.9760 0.9712 3.7201 0.9572 0.9555 0.9451 3.6115 4.0614 4.0729 3.9908 0.9645 3.9739 0.9719 3.9985 0.9692 0.9675 0.9661 3.9280 3.5250 3.3565 0.9665
dispersion: -0.067981388 hartree
energy: -617.682012648160 hartree
dipole: 0.750010678 -0.100982042 0.649028636 7.106555736 -8.733903519 -1.627347783 -0.349027503 0.489800674 0.140773172
dipolemethod: SCF
magnitude: 1.757645033 au
magnitude: 4.467578631 debye
