program: Orca
programVersion: 6.1.x
elementType: N O C C H C H H H H H H C C O Li O O C H H H C H H H C H H H C H H H C C C C H C H C N O O F F
charge: 0
multiplicity: 1
keywords: wb97x-d3bj def2-tzvppd def2/J tightscf defgrid3
formula: C15H21F2LiN2O6
InChI: InChI=1/C11H9F2N2O4.2C2H6O.Li/c1-5-9(11(16)19-14(5)2)6-3-7(12)10(15(17)18)8(13)4-6;2*1-3-2;/h3-5H,1-2H3;2*1-2H3;/q-1;;;+1/rC15H21F2LiN2O6/c1-9-13(10-7-11(16)14(20(21)22)12(17)8-10)15-23-18(24(3)4,25(5)6)26(15)19(9)2/h7-9H,1-6H3
47 atoms
N  1.811353 2.149211 -0.831043
O  2.220804 1.151472 0.114668
C  0.372733 2.363941 -0.520137
C  2.029491 1.578715 -2.155187
H  -0.136773 2.579464 -1.473448
C  0.205004 3.551194 0.425947
H  3.097437 1.347264 -2.274546
H  1.433815 0.663227 -2.331896
H  1.753455 2.340186 -2.89906
H  0.566873 4.481178 -0.041642
H  -0.855308 3.68349 0.693001
H  0.771913 3.380636 1.355291
C  1.105412 0.387314 0.490855
C  -0.051085 1.036301 0.07625
O  1.393931 -0.675532 1.078087
Li 3.209351 -0.682894 0.331576
O  3.237566 -1.623912 -1.314485
O  4.927563 -0.507499 1.093745
C  2.119892 -2.355635 -1.793951
H  1.729018 -1.905242 -2.723359
H  2.399569 -3.405456 -1.992135
H  1.342903 -2.323805 -1.018439
C  4.302025 -1.532335 -2.245335
H  3.95562 -1.078483 -3.190492
H  5.084331 -0.897636 -1.806317
H  4.721711 -2.53143 -2.458591
C  5.919035 -1.52121 1.053709
H  6.15821 -1.871644 2.073014
H  5.520934 -2.36182 0.468163
H  6.840129 -1.14659 0.573509
C  5.31134 0.641663 1.834296
H  6.21454 1.101071 1.395639
H  4.481197 1.359959 1.789797
H  5.511736 0.376692 2.887161
C  -1.383442 0.550054 0.221085
C  -2.487886 1.297743 -0.27132
C  -1.661388 -0.697875 0.846652
C  -3.773906 0.822414 -0.139323
H  -2.350871 2.255976 -0.774754
C  -2.95395 -1.15632 0.947171
H  -0.856383 -1.304652 1.261641
C  -4.056968 -0.418536 0.466211
N  -5.406127 -0.910258 0.586648
O  -5.591167 -2.114288 0.50602
O  -6.302848 -0.100765 0.762832
F  -3.166957 -2.319672 1.564903
F  -4.771631 1.546724 -0.647404
elementType: N O C H Li F
totalener: -1353.09692401509255 hartree
nucrepener: 2400.44592425253268 hartree
electener: -3753.50821619766975 hartree
oneelecener: -6625.24155645445171 hartree
twoeener: 2871.73334025678196 hartree
cpcmener: -0.03370194010651 hartree
kineticenergy: 1347.18355379631748 hartree
exchangeener: -115.898647496337 hartree
energy: -674.5318 -674.4898 -524.3267 -523.8252 -523.7618 -523.6326 -523.6321 -522.1206 -398.8785 -393.6705 -282.6246 -282.5849 -282.4971 -281.0761 -280.9002 -280.8733 -280.8518 -280.7864 -280.7032 -280.4775 -280.0092 -279.6570 -279.5723 -279.0540 -278.9085 -55.6994 -37.5970 -37.4775 -37.2019 -34.0409 -32.4813 -32.4246 -32.2936 -31.2355 -27.8644 -27.1851 -26.0918 -24.9094 -24.3146 -23.5771 -23.4797 -23.3754 -22.1470 -21.5305 -21.1162 -21.0642 -20.8305 -20.3127 -19.6300 -19.0552 -18.4376 -18.3114 -17.8420 -17.5514 -16.9419 -16.7963 -16.7666 -16.6778 -16.6115 -16.5247 -16.4248 -16.4132 -16.3836 -16.2700 -16.2621 -16.1585 -15.6364 -15.5652 -15.1139 -14.7501 -14.3624 -14.2298 -13.9476 -13.8990 -13.8300 -13.7147 -13.5157 -13.4077 -13.3583 -13.3014 -13.2096 -12.7986 -12.6103 -12.5589 -12.5102 -12.1964 -11.6291 -11.4769 -11.3082 -11.2095 -10.8396 -10.7179 -10.6567 -10.3830 -9.5537 -9.2857 -7.3107 -0.1124 1.0990 1.2344 1.2472 1.4552 1.8196 1.8681 1.8932 2.1171 2.3567 2.3930 electronvolt
chargesum: -0.0000000
charge: -0.045539 -0.260123 0.891167 -0.187556 0.148721 -0.948023 0.048336 0.067071 0.092122 0.131172 0.120363 0.097057 1.227522 -0.627587 -0.837064 0.667297 -0.048763 -0.103321 -0.199855 0.152242 0.132397 -0.040751 -0.187539 0.134039 -0.009125 0.123975 -0.181125 0.107009 0.024795 0.134777 -0.166764 0.123159 -0.000455 0.111392 0.660835 -0.578898 -0.664588 0.771104 -0.029483 0.979809 -0.102482 -0.935076 0.836971 -0.509230 -0.509515 -0.310709 -0.299762
charge: -0.053412 -0.011301 -0.201234 0.150654 0.051461 0.176730 0.008842 0.013917 0.017961 -0.005185 -0.006266 0.001704 -0.413823 -0.090358 0.033214 0.196676 -0.181381 -0.175675 0.139176 0.019675 0.023024 0.011339 0.127571 0.020070 0.016915 0.024198 0.133210 0.022501 0.016983 0.023781 0.141980 0.023050 0.013495 0.022632 -0.106718 0.115090 0.124120 -0.194893 0.027614 -0.193404 0.013743 -0.034810 -0.348656 0.060502 0.060519 0.091871 0.092901
qa: -0.0455 -0.2601 0.8912 -0.1876 0.1487 -0.9480 0.0483 0.0671 0.0921 0.1312 0.1204 0.0971 1.2275 -0.6276 -0.8371 0.6673 -0.0488 -0.1033 -0.1999 0.1522 0.1324 -0.0408 -0.1875 0.1340 -0.0091 0.1240 -0.1811 0.1070 0.0248 0.1348 -0.1668 0.1232 -0.0005 0.1114 0.6608 -0.5789 -0.6646 0.7711 -0.0295 0.9798 -0.1025 -0.9351 0.8370 -0.5092 -0.5095 -0.3107 -0.2998
va: 2.3962 1.5547 3.4108 4.1243 0.8543 4.0864 1.1001 1.0163 1.0660 1.0631 1.0695 1.0662 2.4690 1.6323 1.4150 0.4812 2.3546 2.0223 4.1370 1.0007 0.9744 1.1359 4.0413 0.9996 1.1183 1.0058 3.9813 1.0321 1.0833 1.0364 4.0416 1.0255 1.1081 1.0468 0.3351 3.4402 2.9881 2.3267 1.0361 1.9146 1.0399 4.1060 3.9477 1.7538 1.7539 1.0213 1.0170
dispersion: -0.097037755 hartree
energy: -1353.193961769797 hartree
dipole: 61.233383610 -52.845122219 8.388261391 5.929801830 -5.943622656 -0.013820826 -12.444545499 10.425274639 -2.019270860
dipolemethod: SCF
magnitude: 8.627895165 au
magnitude: 21.930366675 debye
