program: Orca
programVersion: 6.1.x
elementType: N O C C H C H H H H H H C C O Li O O C H H H C H H H C H H H C H H H C C C C H C H C H H O C H H H
charge: 0
multiplicity: 1
keywords: wb97x-d3bj def2-tzvppd def2/J tightscf defgrid3
formula: C16H26LiNO5
InChI: InChI=1/C12H14NO3.2C2H6O.Li/c1-8-11(12(14)16-13(8)2)9-4-6-10(15-3)7-5-9;2*1-3-2;/h4-8H,1-3H3;2*1-2H3;/q-1;;;+1/rC16H26LiNO5/c1-12-15(13-8-10-14(19-3)11-9-13)16-20-17(21(4)5,22(6)7)23(16)18(12)2/h8-12H,1-7H3
49 atoms
N  1.062639 1.714181 -1.606737
O  1.622591 1.219659 -0.387503
C  -0.380519 1.890485 -1.292189
C  1.295686 0.69261 -2.620075
H  -0.942917 1.650806 -2.210664
C  -0.665401 3.338681 -0.895495
H  2.378052 0.528126 -2.723191
H  0.801196 -0.267919 -2.381561
H  0.909308 1.070047 -3.578435
H  -0.442582 4.029336 -1.725593
H  -1.723423 3.461327 -0.614308
H  -0.048074 3.621664 -0.027508
C  0.595362 0.564003 0.353169
C  -0.623409 0.884469 -0.184119
O  1.050999 -0.153987 1.285541
Li 2.759647 -0.323771 0.388124
O  2.78575 -1.856885 -0.743669
O  4.539532 0.189227 0.802139
C  1.682494 -2.745991 -0.812526
H  1.212102 -2.707848 -1.810955
H  2.005357 -3.782194 -0.60706
H  0.954652 -2.429923 -0.053238
C  3.777806 -2.098659 -1.724256
H  3.34548 -2.049614 -2.739372
H  4.55023 -1.32345 -1.623949
H  4.238976 -3.091817 -1.578397
C  5.557073 -0.726664 1.169403
H  5.776492 -0.655243 2.249378
H  5.198766 -1.740338 0.941753
H  6.481249 -0.531135 0.59729
C  4.866895 1.545567 1.062661
H  5.778624 1.836707 0.511888
H  4.023881 2.162074 0.721576
H  5.027126 1.707724 2.143375
C  -1.929104 0.40017 0.250916
C  -3.109157 0.755354 -0.427174
C  -2.074478 -0.460351 1.367398
C  -4.368976 0.287308 -0.030802
H  -3.057204 1.417685 -1.295809
C  -3.319013 -0.930248 1.766618
H  -1.181456 -0.757615 1.921917
C  -4.48188 -0.562384 1.072095
H  -3.411033 -1.594091 2.631307
H  -5.249362 0.597557 -0.59663
O  -5.66168 -1.070303 1.539502
C  -6.848385 -0.747771 0.84376
H  -6.812668 -1.099783 -0.202094
H  -7.668776 -1.259663 1.365099
H  -7.041964 0.339058 0.852953
elementType: N O C H Li
totalener: -1064.51598380381643 hartree
nucrepener: 1956.38309997636020 hartree
electener: -3020.86553286196158 hartree
oneelecener: -5340.13204480958575 hartree
twoeener: 2319.26651194762417 hartree
cpcmener: -0.03156668215730 hartree
kineticenergy: 1059.27849952837573 hartree
exchangeener: -95.591832390771 hartree
energy: -523.7996 -523.7107 -523.6258 -523.3829 -521.4364 -393.3357 -281.7223 -280.8331 -280.8200 -280.7772 -280.7597 -280.6673 -280.5631 -280.1645 -279.8141 -279.5761 -279.3001 -279.2601 -279.2381 -279.1860 -278.8685 -278.3632 -55.3568 -33.4366 -32.3823 -32.3348 -32.3037 -30.4873 -26.8521 -26.5813 -24.9610 -23.7988 -23.6311 -23.4874 -23.3755 -22.6025 -21.8250 -21.2527 -21.0227 -20.9522 -19.8698 -19.3654 -18.8376 -17.9379 -17.2482 -16.6897 -16.5062 -16.4337 -16.3294 -16.3120 -16.2680 -16.1396 -16.0426 -15.8404 -15.6185 -15.3665 -14.8978 -14.7163 -14.3659 -14.0811 -13.9715 -13.8705 -13.8609 -13.7887 -13.7434 -13.4240 -13.3831 -13.2344 -13.1262 -12.8478 -12.5637 -12.4972 -12.3965 -12.3407 -12.2118 -11.8428 -11.5488 -11.3413 -11.1355 -10.6408 -10.5500 -10.2582 -9.2974 -9.1612 -8.8722 -6.5855 1.1609 1.2911 1.3085 1.5340 1.8702 1.9454 2.1263 2.2033 2.4081 2.4665 2.5241 electronvolt
chargesum: -0.0000000
charge: -0.043637 -0.274754 1.048816 -0.182975 0.143421 -0.992894 0.044919 0.051661 0.090685 0.129256 0.128516 0.106435 1.157910 -0.905996 -0.891104 0.662473 -0.034722 -0.118066 -0.229301 0.154800 0.129609 -0.025446 -0.201131 0.130699 0.000798 0.124325 -0.167383 0.101290 0.026975 0.128619 -0.178856 0.119577 0.009277 0.116805 0.365869 -0.380697 -0.351573 -0.111655 -0.011345 -0.156066 -0.045126 0.569082 0.012997 0.002381 -0.356638 -0.205475 0.127960 0.056027 0.123657
charge: -0.064988 -0.033824 -0.212203 0.143154 0.045878 0.169613 0.007955 0.009513 0.015401 -0.008153 -0.009693 -0.000567 -0.430603 -0.106509 -0.011081 0.181075 -0.179566 -0.175355 0.136319 0.018339 0.022309 0.009991 0.124081 0.019681 0.015433 0.023533 0.131328 0.022649 0.015148 0.023530 0.139933 0.022056 0.012966 0.022818 -0.150031 0.038391 0.050666 0.050256 0.009390 0.059038 -0.000807 -0.270789 0.021031 0.006274 -0.058634 0.099994 0.015801 0.014186 0.015072
qa: -0.0436 -0.2748 1.0488 -0.1830 0.1434 -0.9929 0.0449 0.0517 0.0907 0.1293 0.1285 0.1064 1.1579 -0.9060 -0.8911 0.6625 -0.0347 -0.1181 -0.2293 0.1548 0.1296 -0.0254 -0.2011 0.1307 0.0008 0.1243 -0.1674 0.1013 0.0270 0.1286 -0.1789 0.1196 0.0093 0.1168 0.3659 -0.3807 -0.3516 -0.1117 -0.0113 -0.1561 -0.0451 0.5691 0.0130 0.0024 -0.3566 -0.2055 0.1280 0.0560 0.1237
va: 2.3549 1.5104 3.1295 4.1421 0.8410 4.0646 1.1017 1.0153 1.0663 1.0708 1.0642 1.0595 2.5209 1.9921 1.3404 0.4728 2.3149 1.9334 4.1528 0.9927 0.9772 1.1458 4.0566 1.0062 1.1026 1.0094 3.9825 1.0411 1.0805 1.0348 4.0509 1.0256 1.0906 1.0512 0.7252 2.5055 2.4872 3.0060 0.9948 3.1770 0.9722 2.6911 0.9996 0.9489 1.6517 3.9480 1.0352 1.0532 1.0379
dispersion: -0.096694950 hartree
energy: -1064.612678754272 hartree
dipole: 11.931136430 -8.266051716 3.665084714 -1.962123937 0.635817281 -1.326306657 -10.204090443 8.372415895 -1.831674549
dipolemethod: SCF
magnitude: 4.306618971 au
magnitude: 10.946555487 debye
