program: Orca
programVersion: 6.1.x
elementType: N O C C H C H H H H H H C C O Li O O C H H H C H H H C H H H C H H H C C C C H C H C H H C C H
charge: 0
multiplicity: 1
keywords: wb97x-d3bj def2-tzvppd def2/J tightscf defgrid3
formula: C17H24LiNO4
InChI: InChI=1/C13H12NO2.2C2H6O.Li/c1-4-10-5-7-11(8-6-10)12-9(2)14(3)16-13(12)15;2*1-3-2;/h1,5-9H,2-3H3;2*1-2H3;/q-1;;;+1/rC17H24LiNO4/c1-8-14-9-11-15(12-10-14)16-13(2)19(3)23-17(16)20-18(23,21(4)5)22(6)7/h1,9-13H,2-7H3
47 atoms
N  1.079269 2.081752 -0.804616
O  1.484945 1.143046 0.196499
C  -0.384913 2.223315 -0.585224
C  1.403068 1.483847 -2.094046
H  -0.846607 2.378764 -1.574599
C  -0.673871 3.434154 0.300897
H  2.48685 1.30599 -2.145589
H  0.867489 0.53234 -2.273006
H  1.132074 2.204732 -2.879379
H  -0.342377 4.367731 -0.182715
H  -1.752895 3.512113 0.507727
H  -0.149744 3.332707 1.265016
C  0.375988 0.325047 0.534317
C  -0.774336 0.89514 0.035059
O  0.702847 -0.706217 1.172524
Li 2.525976 -0.620413 0.484888
O  2.677759 -1.640245 -1.114179
O  4.219831 -0.371691 1.294285
C  1.601017 -2.420671 -1.608984
H  1.235377 -2.016376 -2.569473
H  1.917152 -3.468651 -1.757011
H  0.793657 -2.382178 -0.865419
C  3.775689 -1.551882 -2.004158
H  3.456226 -1.146673 -2.980549
H  4.520074 -0.876116 -1.560494
H  4.234073 -2.544704 -2.16031
C  5.221098 -1.373259 1.358727
H  5.4048 -1.673923 2.405256
H  4.865523 -2.244593 0.791061
H  6.165172 -1.010417 0.915188
C  4.54902 0.81565 1.998796
H  5.469439 1.267164 1.588323
H  3.71381 1.518741 1.875821
H  4.695337 0.603569 3.072518
C  -2.114346 0.357837 0.122383
C  -3.213165 1.036676 -0.459007
C  -2.390744 -0.869388 0.778301
C  -4.503719 0.524383 -0.392229
H  -3.05114 1.986319 -0.975399
C  -3.680141 -1.379748 0.843191
H  -1.56607 -1.416629 1.239266
C  -4.763138 -0.693918 0.260102
H  -3.861466 -2.328797 1.356292
H  -5.330035 1.07419 -0.852099
C  -6.101708 -1.224733 0.332813
C  -7.228479 -1.671219 0.395387
H  -8.230385 -2.067714 0.450879
elementType: N O C H Li
totalener: -1026.12074268606875 hartree
nucrepener: 1878.57582530099899 hartree
electener: -2904.66235869179218 hartree
oneelecener: -5129.71682153039637 hartree
twoeener: 2225.05446283860419 hartree
cpcmener: -0.03327074532568 hartree
kineticenergy: 1020.99913258210245 hartree
exchangeener: -92.960280105086 hartree
energy: -523.9955 -523.7514 -523.6751 -521.6980 -393.4545 -282.0265 -280.8495 -280.8135 -280.7935 -280.7079 -280.2678 -279.9727 -279.9710 -279.8824 -279.7639 -279.6529 -279.6286 -279.3546 -279.3052 -279.2240 -278.9274 -278.5455 -55.4839 -33.6608 -32.4188 -32.3479 -30.7768 -27.1264 -26.8406 -25.3818 -24.4389 -23.7502 -23.5190 -23.4133 -23.4015 -22.4321 -21.3580 -21.0568 -20.9929 -20.3442 -19.8709 -19.0346 -18.0643 -17.8379 -16.8445 -16.7168 -16.5203 -16.3732 -16.3519 -16.3463 -16.3071 -16.1874 -16.0660 -15.6885 -15.3441 -14.8919 -14.6530 -14.2665 -14.1782 -14.0562 -13.8936 -13.8589 -13.7897 -13.5385 -13.4750 -13.3943 -13.2371 -12.9108 -12.6393 -12.5384 -12.4497 -12.3926 -12.1141 -11.7686 -11.5198 -11.2399 -10.6789 -10.6050 -10.5015 -10.3482 -9.4510 -9.4313 -9.0192 -6.8391 1.1186 1.1479 1.2757 1.2935 1.5221 1.9058 1.9212 2.1963 2.4408 2.4737 2.5749 electronvolt
chargesum: -0.0000000
charge: -0.037753 -0.272743 0.976910 -0.184491 0.146474 -0.966329 0.045856 0.057489 0.090066 0.126944 0.131033 0.099764 1.177849 -0.822289 -0.865358 0.652350 -0.036929 -0.090562 -0.216882 0.151811 0.132193 -0.031104 -0.195792 0.132872 -0.004377 0.124293 -0.182334 0.105977 0.025802 0.133961 -0.174757 0.121226 0.003679 0.110243 0.446644 -0.151747 -0.113076 -0.445042 0.023432 -0.379712 0.003309 0.051752 0.010607 0.025583 -0.233344 0.175901 0.120602
charge: -0.061159 -0.026510 -0.208784 0.145852 0.047937 0.171943 0.008205 0.011671 0.016328 -0.006996 -0.008993 0.000273 -0.422325 -0.101068 0.006528 0.186074 -0.180497 -0.174979 0.137521 0.019160 0.022565 0.010157 0.125312 0.020036 0.016446 0.023657 0.131548 0.022286 0.016491 0.023554 0.140604 0.022578 0.013240 0.022380 -0.133700 0.043522 0.055147 0.034984 0.008783 0.035840 -0.002439 -0.253805 0.021831 0.021913 -0.108902 0.179932 -0.074142
qa: -0.0378 -0.2727 0.9769 -0.1845 0.1465 -0.9663 0.0459 0.0575 0.0901 0.1269 0.1310 0.0998 1.1778 -0.8223 -0.8654 0.6524 -0.0369 -0.0906 -0.2169 0.1518 0.1322 -0.0311 -0.1958 0.1329 -0.0044 0.1243 -0.1823 0.1060 0.0258 0.1340 -0.1748 0.1212 0.0037 0.1102 0.4466 -0.1517 -0.1131 -0.4450 0.0234 -0.3797 0.0033 0.0518 0.0106 0.0256 -0.2333 0.1759 0.1206
va: 2.3842 1.5255 3.2859 4.1366 0.8500 4.0868 1.1004 1.0182 1.0676 1.0726 1.0648 1.0634 2.5236 2.0488 1.3803 0.5026 2.3114 2.0074 4.1449 1.0003 0.9741 1.1417 4.0454 1.0028 1.1111 1.0084 3.9827 1.0334 1.0812 1.0363 4.0486 1.0253 1.1018 1.0474 1.0005 2.3646 2.3968 2.7613 0.9844 2.6580 0.9472 0.6052 1.0011 0.9862 2.6297 3.6204 1.0338
dispersion: -0.096179472 hartree
energy: -1026.216922157899 hartree
dipole: 23.732016131 -18.375811313 5.356204817 1.422073142 -2.208529955 -0.786456813 -7.772559617 6.274520642 -1.498038975
dipolemethod: SCF
magnitude: 5.617077989 au
magnitude: 14.277477598 debye
