program: Orca
programVersion: 6.1.x
elementType: N O C C H C H H H H H H C C O Li O O C H H H C H H H C H H H C H H H C C C C H C H C H H N O O
charge: 0
multiplicity: 1
keywords: wb97x-d3bj def2-tzvppd def2/J tightscf defgrid3
formula: C15H23LiN2O6
InChI: InChI=1/C8H4NO3.C3H7NO.2C2H6O.Li/c10-6-5-7-1-3-8(4-2-7)9(11)12;1-3-4(2)5;2*1-3-2;/h1-4H;3H,1-2H3;2*1-2H3;/q2*-1;;;+2/rC15H23LiN2O6/c1-7-17(2)22-16(23(3)4,24(5)6)21-13-12-14-8-10-15(11-9-14)18(19)20/h7-11H,1-6H3
47 atoms
N  1.20588 1.413205 -1.45211
O  2.417248 0.914282 -1.124839
C  0.578972 2.208776 -0.580752
C  0.435811 0.579382 -2.348685
H  -0.378965 2.582845 -0.954695
C  1.401618 3.173523 0.22691
H  1.032904 0.369449 -3.248504
H  0.184278 -0.379669 -1.858915
H  -0.493919 1.090544 -2.638953
H  1.887631 3.889266 -0.457576
H  0.760771 3.729893 0.924587
H  2.193383 2.659582 0.788042
C  0.74182 0.504204 1.471046
C  -0.237646 1.004644 0.817462
O  1.760967 0.162331 2.008222
Li 2.762184 -0.289938 0.233965
O  2.104498 -2.083105 -0.102867
O  4.681899 -0.269277 0.578556
C  1.629759 -3.017641 0.846825
H  0.627954 -3.388794 0.564368
H  2.318139 -3.878413 0.929708
H  1.569218 -2.508774 1.817982
C  2.191362 -2.598519 -1.417958
H  1.198302 -2.921808 -1.778978
H  2.566984 -1.795279 -2.066199
H  2.881933 -3.460548 -1.458361
C  5.440898 -0.872235 -0.454655
H  6.503145 -0.953008 -0.162373
H  5.039643 -1.881868 -0.620363
H  5.367867 -0.291109 -1.391534
C  5.138801 1.029012 0.91997
H  5.080558 1.709143 0.052234
H  4.493012 1.408872 1.723964
H  6.181103 0.990258 1.284156
C  -1.612997 0.597226 0.590355
C  -2.597223 1.533857 0.20903
C  -2.002581 -0.756528 0.727246
C  -3.910333 1.14427 -0.02866
H  -2.330546 2.58901 0.112941
C  -3.309655 -1.158096 0.496812
H  -1.252016 -1.498488 1.01311
C  -4.254343 -0.20021 0.115637
H  -3.60045 -2.204088 0.604273
H  -4.665824 1.876141 -0.318314
N  -5.633031 -0.617129 -0.136799
O  -5.911084 -1.797732 -0.012277
O  -6.443986 0.233286 -0.461515
elementType: N O C H Li
totalener: -1154.46101196737118 hartree
nucrepener: 2078.52324318668207 hartree
electener: -3232.95716883428986 hartree
oneelecener: -5705.20468697984415 hartree
twoeener: 2472.24751814555430 hartree
cpcmener: -0.02397851983535 hartree
kineticenergy: 1149.06801231125564 hartree
exchangeener: -101.838189894615 hartree
energy: -523.7515 -523.7504 -523.5030 -523.4694 -523.4561 -521.0081 -398.8473 -393.6292 -281.7815 -281.1253 -281.0472 -280.7020 -280.6821 -280.6692 -280.6648 -280.6189 -280.2058 -280.1815 -279.9207 -279.8540 -279.8356 -279.2384 -278.9881 -54.8530 -37.3848 -32.6810 -32.4102 -32.2249 -32.1676 -31.6127 -27.7904 -26.2005 -25.7421 -24.3520 -24.2557 -23.7366 -23.3562 -23.2764 -22.0332 -21.6638 -20.9048 -20.8517 -20.2982 -19.4722 -18.5843 -18.4010 -18.0720 -17.4645 -17.3275 -16.6490 -16.5060 -16.3456 -16.3185 -16.2178 -16.2007 -16.1100 -16.0319 -15.9809 -15.6414 -15.3753 -15.2981 -14.7961 -14.6641 -14.5617 -13.8599 -13.7676 -13.7490 -13.7006 -13.6185 -13.4559 -13.2705 -13.1661 -13.0278 -12.6799 -12.4818 -12.3080 -12.1699 -12.0817 -11.6004 -11.5176 -11.1280 -10.8972 -10.5000 -10.4278 -9.9108 -9.8477 -9.2219 -8.1852 -7.0250 -0.3790 1.1502 1.2202 1.2770 1.3851 1.4779 1.6256 1.9244 2.0366 2.1185 2.3218 electronvolt
chargesum: 0.0000000
charge: 0.469654 -0.798533 0.424169 -0.146247 0.280774 -0.644674 0.027727 -0.037730 0.119052 0.111491 0.116829 -0.055355 0.824241 -0.967654 -0.606851 0.697533 0.077608 -0.202783 -0.259843 0.118918 0.105411 0.019480 -0.234714 0.117934 0.016031 0.126520 -0.030101 0.118291 -0.027846 0.074885 -0.072456 0.074839 0.015681 0.115241 0.357577 -0.015726 -0.098088 -0.135333 0.059433 -0.053377 0.063026 -0.021766 0.034996 0.046057 0.898923 -0.553276 -0.549968
charge: -0.237697 -0.175474 -0.090703 0.171217 0.034422 0.170363 0.011985 0.005760 0.016122 0.009420 0.004663 -0.018070 -0.208921 -0.045181 0.084887 0.089342 -0.176008 -0.165565 0.127436 0.018217 0.021121 0.010201 0.115570 0.020465 0.009623 0.020464 0.124430 0.020069 0.013790 0.022668 0.119182 0.018094 0.015086 0.019004 -0.176642 0.057870 0.068400 0.087317 0.022235 0.085896 0.021912 -0.131104 0.023558 0.023890 -0.357057 0.048782 0.048964
qa: 0.4697 -0.7985 0.4242 -0.1462 0.2808 -0.6447 0.0277 -0.0377 0.1191 0.1115 0.1168 -0.0554 0.8242 -0.9677 -0.6069 0.6975 0.0776 -0.2028 -0.2598 0.1189 0.1054 0.0195 -0.2347 0.1179 0.0160 0.1265 -0.0301 0.1183 -0.0278 0.0749 -0.0725 0.0748 0.0157 0.1152 0.3576 -0.0157 -0.0981 -0.1353 0.0594 -0.0534 0.0630 -0.0218 0.0350 0.0461 0.8989 -0.5533 -0.5500
va: 2.8406 1.1645 3.7323 4.0414 0.7554 4.2236 1.0709 1.0578 0.9865 1.0405 1.0403 1.1611 3.8399 2.0013 1.9318 0.4421 2.3757 1.8029 4.1386 1.0117 1.0553 1.1062 4.1330 1.0208 1.1107 1.0007 3.9569 1.0217 1.1128 1.0862 3.9710 1.0820 1.0703 1.0353 1.5723 3.1363 3.0841 3.2439 0.9303 3.0252 0.8640 3.0765 0.9852 0.9635 3.6892 1.7046 1.7063
dispersion: -0.098704337 hartree
energy: -1154.559716304312 hartree
dipole: 34.374646587 -30.645525965 3.729120621 -1.877635321 1.155943162 -0.721692159 -7.238660789 6.701612176 -0.537048613
dipolemethod: SCF
magnitude: 3.836091943 au
magnitude: 9.750570828 debye
