program: Orca
programVersion: 6.1.x
elementType: N O C C H C H H H H H H C C O Li O O C H H H C H H H C H H H C H H H C C C C H C H C H H Cl
charge: 0
multiplicity: 1
keywords: wb97x-d3bj def2-tzvppd def2/J tightscf defgrid3
formula: C15H23ClLiNO4
InChI: InChI=1/C11H11ClNO2.2C2H6O.Li/c1-8(13(2)15)11(7-14)9-3-5-10(12)6-4-9;2*1-3-2;/h3-6,8H,1-2H3;2*1-2H3;/q-2;;;+2/rC15H23ClLiNO4/c1-12-15(13-7-9-14(16)10-8-13)11-19-17(21(3)4,22(5)6)20-18(12)2/h7-10,12H,1-6H3
45 atoms
N  1.004487 1.707461 -1.454702
O  1.984852 1.318176 -0.553674
C  -0.164045 2.077033 -0.678601
C  0.733828 0.621561 -2.379022
H  -1.013376 2.164113 -1.374511
C  0.042383 3.417644 0.022277
H  1.650577 0.403713 -2.94934
H  0.418005 -0.310175 -1.86392
H  -0.05463 0.917824 -3.090448
H  0.238457 4.208638 -0.719743
H  -0.848045 3.696654 0.607811
H  0.904033 3.35321 0.703379
C  0.428203 0.413253 1.070866
C  -0.525461 0.969522 0.335517
O  1.278214 -0.082556 1.726289
Li 2.650848 -0.248813 0.021906
O  2.298235 -2.062573 -0.553325
O  4.515171 -0.212863 0.438084
C  1.157882 -2.833557 -0.218785
H  0.324745 -2.633811 -0.916856
H  1.397874 -3.911283 -0.2442
H  0.856066 -2.559669 0.800544
C  2.87522 -2.415046 -1.798194
H  2.138607 -2.325571 -2.616104
H  3.712433 -1.72864 -1.990631
H  3.258155 -3.450834 -1.770097
C  5.356292 -1.312979 0.72396
H  5.870362 -1.173331 1.691977
H  4.726758 -2.21197 0.775371
H  6.114593 -1.444611 -0.069325
C  5.191158 1.030149 0.347427
H  5.965097 0.996351 -0.440712
H  4.437196 1.786941 0.08887
H  5.668134 1.286511 1.310429
C  -1.930063 0.544128 0.560698
C  -3.007762 1.377716 0.21341
C  -2.229851 -0.710063 1.128808
C  -4.328929 0.98081 0.424785
H  -2.825085 2.363515 -0.219937
C  -3.543168 -1.113249 1.354324
H  -1.41967 -1.398261 1.389262
C  -4.58978 -0.262208 0.997029
H  -3.755496 -2.090055 1.795491
H  -5.15466 1.64178 0.150543
Cl -6.237909 -0.762408 1.265625
elementType: N O C H Li Cl
totalener: -1409.48025532254746 hartree
nucrepener: 1927.58640158653770 hartree
electener: -3337.03825040145375 hartree
oneelecener: -5760.55871686374576 hartree
twoeener: 2423.52046646229201 hartree
cpcmener: -0.02526868150871 hartree
kineticenergy: 1404.02703667384071 hartree
exchangeener: -106.199244103519 hartree
energy: -2762.6409 -524.0796 -523.5877 -523.5135 -520.5412 -392.3784 -282.7233 -281.2486 -280.7519 -280.7251 -280.6985 -280.5723 -280.4128 -280.2528 -279.9511 -279.9373 -279.8301 -279.7799 -279.6940 -279.3996 -278.8471 -260.2715 -199.1780 -198.9395 -198.9331 -54.8807 -33.4669 -32.3001 -32.2017 -30.5438 -28.0183 -26.7949 -25.6194 -24.6047 -24.1929 -23.5088 -23.4166 -23.3065 -22.7559 -20.9753 -20.8496 -20.7938 -20.3137 -19.6556 -18.7978 -17.7118 -17.0686 -16.6231 -16.4340 -16.2815 -16.2475 -16.1806 -16.1361 -16.0238 -15.8958 -15.6152 -15.5233 -15.2738 -15.0189 -14.5805 -14.5306 -14.3152 -14.1079 -13.8893 -13.8233 -13.7196 -13.3025 -13.2602 -13.1809 -13.0080 -12.6168 -12.5607 -12.3611 -12.2547 -12.1930 -12.0874 -11.9105 -11.4550 -10.6010 -10.5114 -10.4493 -10.0538 -9.7587 -8.8077 -7.8994 -7.0855 1.1772 1.2330 1.2817 1.3056 1.4453 1.4967 1.6243 1.8534 2.0586 2.2244 2.3675 electronvolt
chargesum: -0.0000000
charge: 0.113577 -0.744281 0.864065 -0.067268 0.049303 -0.996091 0.040359 -0.082397 0.083457 0.133288 0.149920 0.073325 0.529333 0.455031 -0.483913 0.682153 -0.137706 -0.055380 -0.204771 0.122996 0.109697 0.003608 -0.142810 0.112590 0.001742 0.123635 -0.245426 0.104633 0.029691 0.159573 -0.196170 0.116390 0.009647 0.114905 -0.219040 0.103613 -0.041611 -0.460321 0.056907 -0.483672 0.016487 0.484215 0.011543 0.022990 -0.317817
charge: -0.217354 -0.236845 -0.234985 0.112828 0.039341 0.170037 0.003318 -0.005892 0.008419 -0.005113 -0.005399 -0.008345 -0.114148 -0.103788 0.151343 0.103692 -0.180030 -0.173727 0.129721 0.019315 0.022019 0.006417 0.125655 0.018952 0.021214 0.022631 0.125307 0.020448 0.013799 0.022296 0.131395 0.021156 -0.000139 0.020304 -0.132097 0.055968 0.055634 -0.021046 0.015865 -0.022194 0.019163 -0.648490 0.014342 0.014219 0.624798
qa: 0.1136 -0.7443 0.8641 -0.0673 0.0493 -0.9961 0.0404 -0.0824 0.0835 0.1333 0.1499 0.0733 0.5293 0.4550 -0.4839 0.6822 -0.1377 -0.0554 -0.2048 0.1230 0.1097 0.0036 -0.1428 0.1126 0.0017 0.1236 -0.2454 0.1046 0.0297 0.1596 -0.1962 0.1164 0.0096 0.1149 -0.2190 0.1036 -0.0416 -0.4603 0.0569 -0.4837 0.0165 0.4842 0.0115 0.0230 -0.3178
va: 2.2290 1.3803 3.1574 4.0900 0.9731 3.9973 1.1033 1.0618 1.0757 1.0307 1.0467 1.0879 3.1866 1.8569 1.9566 0.5151 2.3968 1.7182 4.1930 1.0239 0.9803 1.0924 4.0862 1.0177 1.1068 0.9979 3.9926 1.0506 1.0722 1.0319 4.0470 1.0271 1.1347 1.0341 1.5638 2.7051 2.7198 3.6340 0.9214 3.5863 0.8335 2.7580 0.9700 0.9464 0.9865
dispersion: -0.097284944 hartree
energy: -1409.577540266248 hartree
dipole: 39.722536005 -37.432604214 2.289931791 -1.604086408 -0.903763912 -2.507850320 -13.576821113 13.168907091 -0.407914022
dipolemethod: SCF
magnitude: 3.420452409 au
magnitude: 8.694099093 debye
