program: Orca
programVersion: 6.1.x
elementType: N O C C H C H H H H H H C C O Li O O C H H H C H H H C H H H C H H H C C C C H C H C N O O F F
charge: 0
multiplicity: 1
keywords: wb97x-d3bj def2-tzvppd def2/J tightscf defgrid3
formula: C15H21F2LiN2O6
InChI: InChI=1/C11H9F2N2O4.2C2H6O.Li/c1-6(14(2)17)8(5-16)7-3-9(12)11(15(18)19)10(13)4-7;2*1-3-2;/h3-4,6H,1-2H3;2*1-2H3;/q-2;;;+2/rC15H21F2LiN2O6/c1-10-12(11-7-13(16)15(20(21)22)14(17)8-11)9-23-18(25(3)4,26(5)6)24-19(10)2/h7-8,10H,1-6H3
47 atoms
N  1.782268 2.099528 -0.880991
O  2.506135 1.426707 0.088535
C  0.437717 2.209154 -0.352904
C  1.828786 1.358865 -2.130233
H  -0.234544 2.454808 -1.18921
C  0.337825 3.307281 0.703441
H  2.876188 1.291098 -2.463618
H  1.42892 0.328142 -2.032051
H  1.253164 1.891593 -2.904401
H  0.595655 4.283433 0.262167
H  -0.683013 3.366123 1.113281
H  1.035125 3.096391 1.527904
C  0.85997 0.08003 0.903091
C  -0.005449 0.851469 0.231213
O  1.621743 -0.599014 1.494498
Li 3.353797 -0.167758 0.162034
O  3.392668 -1.625418 -1.085913
O  5.002599 -0.205545 1.12056
C  2.293249 -2.439384 -1.454834
H  1.901382 -2.146399 -2.444931
H  2.591064 -3.502609 -1.486348
H  1.505358 -2.308924 -0.700821
C  4.464313 -1.670771 -2.011746
H  4.129333 -1.352037 -3.014775
H  5.247578 -0.984999 -1.659183
H  4.88086 -2.691596 -2.078347
C  5.852239 -1.316745 1.333387
H  5.964592 -1.522406 2.413016
H  5.394486 -2.189069 0.846791
H  6.850809 -1.13721 0.895571
C  5.458035 0.996394 1.720426
H  6.442998 1.286821 1.312529
H  4.717641 1.774236 1.48716
H  5.540891 0.878063 2.815646
C  -1.404556 0.406652 0.171829
C  -2.408848 1.237892 -0.364015
C  -1.784844 -0.870004 0.648579
C  -3.720288 0.799827 -0.429045
H  -2.201339 2.244151 -0.727181
C  -3.100942 -1.278372 0.593336
H  -1.058964 -1.574592 1.061464
C  -4.102824 -0.460001 0.047072
N  -5.483272 -0.905545 -0.021348
O  -5.931977 -1.512195 0.933353
O  -6.114311 -0.648589 -1.0297
F  -4.64428 1.621055 -0.921402
F  -3.416779 -2.495938 1.02821
elementType: N O C H Li F
totalener: -1353.03531687710938 hartree
nucrepener: 2387.24279833874562 hartree
electener: -3740.24791407805242 hartree
oneelecener: -6598.07125438835283 hartree
twoeener: 2857.82334031030041 hartree
cpcmener: -0.02912133242178 hartree
kineticenergy: 1347.11911513246105 hartree
exchangeener: -115.848634349264 hartree
energy: -674.7955 -674.7924 -524.2299 -524.0189 -524.0182 -523.6798 -523.6020 -520.8705 -399.2176 -392.5600 -283.0981 -282.9242 -282.9120 -281.4943 -281.1897 -280.8215 -280.7984 -280.7646 -280.6490 -280.3977 -280.1003 -280.0420 -279.9647 -279.5133 -278.9474 -55.0745 -37.9248 -37.7818 -37.5750 -33.6783 -32.7275 -32.3844 -32.2814 -30.8792 -28.2770 -26.6669 -25.4901 -24.7433 -24.5988 -23.5068 -23.4917 -23.3674 -22.4776 -21.2341 -21.0460 -20.9246 -20.9084 -20.4859 -19.3887 -19.0655 -18.6497 -18.6194 -17.8335 -17.3572 -17.2555 -17.0540 -16.8754 -16.8451 -16.6987 -16.5398 -16.4747 -16.3494 -16.2838 -16.2429 -16.1070 -15.9071 -15.7311 -15.6484 -15.3593 -15.0191 -14.6116 -14.2715 -13.9990 -13.9114 -13.8641 -13.7895 -13.6922 -13.5224 -13.3802 -13.2961 -13.1641 -12.6895 -12.4752 -12.3531 -12.2895 -12.1187 -11.7831 -11.6396 -11.6297 -10.7925 -10.7364 -10.6176 -10.5288 -9.8112 -9.1413 -8.2160 -7.3123 -0.3229 1.1713 1.2311 1.2711 1.3975 1.4259 1.5521 1.6605 1.8472 2.0826 2.3421 electronvolt
chargesum: 0.0000000
charge: 0.106179 -0.736985 0.811941 -0.189064 0.048934 -0.977679 0.041550 0.014514 0.086931 0.141687 0.141607 0.091230 0.645995 0.499572 -0.483899 0.818470 -0.173111 -0.069772 -0.182438 0.142801 0.116676 -0.037012 -0.186795 0.120534 0.008542 0.136737 -0.221715 0.104759 0.023590 0.159612 -0.204813 0.118602 0.013520 0.117739 0.133939 -0.333620 -0.525078 0.600127 -0.010504 0.768755 -0.121606 -0.841696 0.858750 -0.493401 -0.493445 -0.294422 -0.296238
charge: -0.205253 -0.229596 -0.230712 0.121216 0.037622 0.175958 0.005642 -0.001940 0.009264 -0.003910 -0.003262 -0.005658 -0.109726 -0.094042 0.158870 0.123175 -0.180478 -0.175924 0.132218 0.019580 0.023370 0.009985 0.128745 0.021942 0.018136 0.023866 0.126908 0.021353 0.013848 0.023100 0.133994 0.021534 0.002798 0.021198 -0.098068 0.129423 0.127968 -0.183292 0.028513 -0.187181 0.038137 -0.020665 -0.339986 0.080329 0.080252 0.106116 0.104633
qa: 0.1062 -0.7370 0.8119 -0.1891 0.0489 -0.9777 0.0415 0.0145 0.0869 0.1417 0.1416 0.0912 0.6460 0.4996 -0.4839 0.8185 -0.1731 -0.0698 -0.1824 0.1428 0.1167 -0.0370 -0.1868 0.1205 0.0085 0.1367 -0.2217 0.1048 0.0236 0.1596 -0.2048 0.1186 0.0135 0.1177 0.1339 -0.3336 -0.5251 0.6001 -0.0105 0.7688 -0.1216 -0.8417 0.8588 -0.4934 -0.4934 -0.2944 -0.2962
va: 2.0954 1.3144 3.3609 4.1058 0.9619 3.9636 1.1062 1.0295 1.0663 1.0331 1.0620 1.0663 2.7794 1.4920 2.0053 0.2336 2.2440 1.8234 4.1410 1.0076 0.9917 1.1162 4.0446 1.0278 1.0985 1.0007 3.9742 1.0460 1.0860 1.0270 4.0446 1.0276 1.1257 1.0415 0.3540 3.4548 3.2217 2.3419 0.9770 2.2535 1.0288 4.2010 3.9570 1.7843 1.7852 1.0363 1.0261
dispersion: -0.099123097 hartree
energy: -1353.134439974551 hartree
dipole: 61.624938685 -56.143743136 5.481195549 4.629957628 -6.064042214 -1.434084586 -6.904155733 6.196004582 -0.708151151
dipolemethod: SCF
magnitude: 5.709779444 au
magnitude: 14.513105971 debye
