program: Gaussian 09
title: 000076835
version: EM64L-G09RevD.01
frameworkgroup: C1[X(C7H4N2O3)]
method: RPBEPBE
basis: SDD
operation: Freq
keyword: #pfreq=noraman
keyword: PBEPBE/SDD
title: #p freq=noraman PBEPBE/SDD
converged: NO YES NO NO
title: Mulliken charges:
elementType: O O O N N C C C C C C C H H H H
charge: -0.198075 -0.198502 -0.159195 0.022486 0.066622 0.425659 -0.495963 0.421985 -0.372522 -0.376692 -0.145142 -0.101069 0.307066 0.292765 0.262059 0.248520
chargesum: 0.00000
title: Mulliken charges with hydrogens summed into heavy atoms:
elementType: O O O N N C C C C C C C
charge: -0.198075 -0.198502 -0.159195 0.022486 0.066622 0.425659 -0.188897 0.421985 -0.079758 -0.114633 0.103377 -0.101069
polarizability: 1.72701780e+02 1.36023978e+01 1.09973470e+02 3.25581415e-02 -1.88479760e-02 3.64751424e+01
1716.lowfreq: -45.6276 -7.0003 -5.6101 -0.0009 -0.0004 -0.0003 1.9410 50.4527 79.2434
frequency: -45.6192 50.4509 79.2395 163.8714 200.1481 252.3898 348.5592 400.7258 416.2166 428.6374 482.1049 488.0459 526.6876 532.4858 651.2422 679.6101 706.3969 724.5517 815.0272 848.1274 931.0391 941.1992 985.7109 998.2473 1072.1091 1082.6418 1123.8254 1173.5446 1216.6327 1279.4033 1371.5260 1376.9901 1429.2248 1443.0921 1542.4040 1577.5306 1620.2356 2396.7649 3154.6745 3174.4406 3188.5001 3193.7763
redmass: 11.5875 14.1131 7.9799 5.6206 10.3287 5.3248 11.7781 8.8607 6.9664 3.3034 12.3722 12.6050 6.4117 5.3849 7.6941 2.3961 5.0230 10.8814 1.4459 7.6682 1.5131 1.4101 6.1787 1.3526 1.6209 1.8155 4.4112 1.1297 9.6440 1.3399 5.5339 10.6305 3.2894 2.8649 8.0355 6.8429 7.2713 12.7439 1.0883 1.0954 1.0930 1.0968
irintensity: 0.4675 0.4567 0.0038 1.1825 3.3610 0.0577 0.2719 3.9364 1.7620 0.5248 13.7741 14.7604 0.4216 5.7986 4.2349 16.5615 29.3874 51.0515 42.9095 15.3420 21.2348 12.4042 0.2681 2.2535 14.8117 12.8117 63.3493 7.8395 270.0191 2.4753 0.3267 102.7422 80.3596 2.5732 18.9734 0.1746 57.4354 1648.5893 6.6797 3.7914 4.8656 6.8021
temp: 298.150 k
press: 1.00000 atm
elementType: 8 8 8 7 7 6 6 6 6 6 6 6 1 1 1 1
symmnumber: 1
zpe: 269566.7 jmol-1
zpe.correction: 0.102673 hartree
zpe.thermalcorrener: 0.111844 hartree
zpe.thermalcorrenthalpy: 0.112789 hartree
zpe.thermalcorrgfe: 0.067007 hartree
zpe.sumelectzpe: -603.398313 hartree
zpe.sumelectthermal: -603.389141 hartree
zpe.sumelectthermalent: -603.388196 hartree
zpe.sumelectthermalfe: -603.433978 hartree
dipole: -1.2116 4.2216 -0.0001
dipole: 4.3920
quadrupole: -91.9547 -63.5840 -67.5477
quadrupole: 1.7796 -0.0106 -0.0102
quadrupole: -17.5926 10.7781 6.8144 1.7796 -0.0106 -0.0102
hfenergy: -603.5009851 hartree
pointgroup: C01 [X(C7H4N2O3)]
dipole: 0.6015331 -1.6159503 -0.1125291 debye
dipolederiv: -0.8965176 -0.1020986 -0.0098072 -0.0098947 -0.4848854 -0.0191839 -0.0034946 -0.0194364 -0.2227616 -0.5441802 0.0737704 0.0041782 0.1007968 -0.7984418 -0.0414126 0.0059006 -0.0411655 -0.2256872 -1.7019795 -0.6194303 -0.0418242 -0.7011184 -0.5590518 -0.0199308 -0.0512699 -0.0216135 -0.2650374 1.5713927 -0.2046167 -0.0095899 -0.3537198 1.2123113 0.0729376 -0.0197931 0.0729232 0.1941708 -2.1372196 -0.7884701 -0.0568556 -0.9153057 -0.6776043 -0.033433 -0.0627925 -0.0318481 -0.2128797 -0.3183738 0.3014902 0.0202718 0.2952743 -0.0658223 -0.0092672 0.0197944 -0.009199 0.0769764 -0.1872038 -0.3152793 -0.0224474 0.1200943 -0.0650075 0.0052753 0.0087318 0.0035701 -0.1300441 1.4102834 0.6018127 0.0467465 0.6976853 0.2908353 0.0135118 0.0520456 0.012728 0.1307393 -0.0850072 0.0286618 0.002531 -0.2284899 -0.0735517 0.0029342 -0.016053 0.0039093 -0.1228452 -0.071798 -0.0837601 -0.0051745 -0.2663769 -0.0427165 0.0067153 -0.0184415 0.0071607 -0.1460063 -0.1358574 0.0051593 0.0003988 0.0530729 0.2071919 0.0233552 0.0037593 0.0231591 -0.1157997 2.8246918 1.0843264 0.0719102 1.2171505 0.8771551 0.0351789 0.0839839 0.0364573 0.3487374 0.1430021 0.0030971 0.0000162 -0.0449784 0.0614239 -0.0089519 -0.0034287 -0.0088788 0.1853129 0.0664606 -0.0465123 -0.0038147 -0.0180782 0.1219153 -0.0042154 -0.001782 -0.0043663 0.1792312 -0.0125273 0.0691931 0.0042786 0.0639728 0.072885 -0.0067527 0.0038693 -0.006646 0.1689276 0.0748338 -0.0073437 -0.000818 -0.0100849 -0.0766366 -0.0167609 -0.0010297 -0.0167542 0.1569657 unknown
polarizability: 170.2769428|18.1352532|112.0146155|1.5502331|5.380144|36.8588341 unknown
InChI: InChI=1S/C7H4N2O3/c10-5-8-6-2-1-3-7(4-6)9(11)12/h1-4H
charge 0 multiplicity 1
16 atoms
O  -3.704972 0.10104 0.010421
O  -2.434321 1.989744 0.15177
O  4.505028 1.423451 0.120899
N  -2.568886 0.710011 0.058992
N  2.326512 0.355841 0.051262
C  -1.333999 -0.119077 0.004327
C  -0.088551 0.535414 0.055728
C  1.089633 -0.252003 0.003158
C  -1.458035 -1.521199 -0.096816
C  0.991133 -1.668851 -0.098424
C  -0.274858 -2.287704 -0.147276
C  3.409884 0.889186 0.083766
H  -0.043731 1.624432 0.133799
H  -2.450245 -1.976829 -0.133711
H  1.907659 -2.265332 -0.137658
H  -0.337751 -3.377423 -0.225335
