program: Orca
programVersion: 6.1.x
elementType: N O C C H C H H H H H H C C O Li O O C H H H C H H H C H H H C H H H C C C C H C H C H H C N
charge: 0
multiplicity: 1
keywords: wb97x-d3bj def2-tzvppd def2/J tightscf defgrid3
formula: C16H23LiN2O4
InChI: InChI=1/C12H11N2O2.2C2H6O.Li/c1-9(14(2)16)12(8-15)11-5-3-10(7-13)4-6-11;2*1-3-2;/h3-6,9H,1-2H3;2*1-2H3;/q-2;;;+2/rC16H23LiN2O4/c1-13-16(15-9-7-14(11-18)8-10-15)12-20-17(22(3)4,23(5)6)21-19(13)2/h7-10,13H,1-6H3
46 atoms
N  0.977404 1.818595 -1.274037
O  1.822623 1.319009 -0.295746
C  -0.298004 2.052924 -0.627398
C  0.878939 0.868232 -2.36757
H  -1.052166 2.194565 -1.417057
C  -0.254045 3.303812 0.247695
H  1.878299 0.730553 -2.809821
H  0.507628 -0.125575 -2.0401
H  0.205563 1.258965 -3.147932
H  -0.020701 4.188925 -0.365967
H  -1.221221 3.46833 0.748611
H  0.524757 3.191853 1.016568
C  0.176092 0.136386 0.907103
C  -0.7231 0.819955 0.199064
O  0.972484 -0.469035 1.534195
Li 2.583433 -0.279588 0.027491
O  2.537073 -1.94327 -0.93693
O  4.300571 -0.188341 0.858736
C  1.411591 -2.785783 -1.108157
H  0.971235 -2.656284 -2.112709
H  1.695643 -3.844924 -0.974444
H  0.665916 -2.515375 -0.348631
C  3.562255 -2.169102 -1.888129
H  3.185406 -2.016479 -2.915128
H  4.371284 -1.451693 -1.690858
H  3.959939 -3.19581 -1.798788
C  5.128437 -1.261839 1.261466
H  5.275727 -1.254626 2.356429
H  4.631457 -2.198001 0.971668
H  6.114314 -1.204993 0.765451
C  4.804961 1.093957 1.194068
H  5.783973 1.266339 0.711707
H  4.075936 1.830446 0.828002
H  4.919227 1.19397 2.288465
C  -2.13979 0.410919 0.304991
C  -3.176333 1.233902 -0.178909
C  -2.503825 -0.820243 0.896856
C  -4.509647 0.848045 -0.081433
H  -2.948215 2.199523 -0.632812
C  -3.83001 -1.211239 1.00253
H  -1.7300 -1.493835 1.277289
C  -4.848271 -0.377136 0.50971
H  -4.08392 -2.169282 1.4629
H  -5.295858 1.504317 -0.46295
C  -6.228565 -0.779097 0.61085
N  -7.338095 -1.103089 0.692666
elementType: N O C H Li
totalener: -1042.17010681687407 hartree
nucrepener: 1869.48115689188353 hartree
electener: -2911.61914059722722 hartree
oneelecener: -5132.24484128887798 hartree
twoeener: 2220.62570069165076 hartree
cpcmener: -0.03173308454326 hartree
kineticenergy: 1037.05619780740858 hartree
exchangeener: -93.805410179935 hartree
energy: -524.1590 -523.6414 -523.5538 -520.6869 -392.4626 -392.2779 -282.9159 -280.9015 -280.7915 -280.7699 -280.7366 -280.7098 -280.7007 -280.6000 -280.3169 -280.2235 -280.2213 -279.8978 -279.8297 -279.8155 -279.4551 -278.8930 -54.9646 -33.5737 -32.3512 -32.2412 -30.6989 -28.5530 -27.6097 -26.1136 -24.9897 -24.3381 -24.0216 -23.4646 -23.3363 -23.2247 -21.0139 -20.9334 -20.8838 -20.8505 -20.3322 -18.8638 -18.4044 -17.5650 -16.9055 -16.6645 -16.4372 -16.3191 -16.2963 -16.2111 -16.2014 -16.0598 -15.7212 -15.6240 -15.3491 -15.2005 -14.7293 -14.6593 -14.4885 -14.2566 -14.0529 -13.8351 -13.7571 -13.7043 -13.3530 -13.2959 -13.2194 -13.0851 -12.8650 -12.8391 -12.4516 -12.4216 -12.3028 -12.2128 -12.1450 -11.8952 -10.6668 -10.5818 -10.4853 -10.4610 -9.9020 -8.9688 -8.0179 -7.1880 0.5107 1.1913 1.2504 1.2942 1.4388 1.4762 1.7250 1.9061 2.1727 2.4275 2.5028 electronvolt
chargesum: 0.0000000
charge: 0.105321 -0.734822 0.831884 -0.195075 0.028159 -0.960087 0.032344 0.021059 0.087525 0.135878 0.148086 0.079677 0.721444 0.418136 -0.485552 0.781448 -0.161121 -0.074521 -0.191402 0.144553 0.116091 -0.036096 -0.189151 0.119844 0.007960 0.141193 -0.214597 0.099405 0.022703 0.159728 -0.201514 0.118940 0.000957 0.122833 -0.087550 0.080862 -0.076538 -0.508955 0.038840 -0.422528 -0.055196 0.624181 0.022321 0.018009 -0.305241 -0.329436
charge: -0.212785 -0.234623 -0.234692 0.117027 0.036949 0.172862 0.005094 -0.003500 0.008486 -0.004487 -0.004877 -0.007265 -0.112658 -0.098825 0.155568 0.112520 -0.179496 -0.176504 0.130651 0.019610 0.022979 0.009352 0.128736 0.022216 0.017164 0.023744 0.125769 0.021214 0.013970 0.022848 0.133273 0.021151 0.000094 0.021191 -0.116096 0.065904 0.063850 0.061411 0.013056 0.058144 0.022632 -0.213331 0.030794 0.030977 -0.185594 0.095497
qa: 0.1053 -0.7348 0.8319 -0.1951 0.0282 -0.9601 0.0323 0.0211 0.0875 0.1359 0.1481 0.0797 0.7214 0.4181 -0.4856 0.7814 -0.1611 -0.0745 -0.1914 0.1446 0.1161 -0.0361 -0.1892 0.1198 0.0080 0.1412 -0.2146 0.0994 0.0227 0.1597 -0.2015 0.1189 0.0010 0.1228 -0.0875 0.0809 -0.0765 -0.5090 0.0388 -0.4225 -0.0552 0.6242 0.0223 0.0180 -0.3052 -0.3294
va: 2.1643 1.3707 3.2918 4.1257 0.9717 3.9798 1.1156 1.0126 1.0697 1.0361 1.0511 1.0768 2.8088 1.6275 2.0074 0.3025 2.2017 1.7920 4.1396 1.0062 0.9982 1.1214 4.0423 1.0338 1.0986 0.9996 3.9677 1.0504 1.0851 1.0261 4.0471 1.0246 1.1410 1.0377 1.4070 2.3546 2.4952 2.8591 0.9389 2.8737 0.9846 2.3373 1.0173 1.0165 2.7690 2.4150
dispersion: -0.096929638 hartree
energy: -1042.267036455209 hartree
dipole: 30.555439317 -26.054584406 4.500854910 -0.987401635 -0.903951848 -1.891353483 -8.637284294 7.989143727 -0.648140566
dipolemethod: SCF
magnitude: 4.924936458 au
magnitude: 12.518193639 debye
