program: Orca
programVersion: 6.1.x
elementType: N O C C H C H H H H H H C C O Li O O C H H H C H H H C H H H C H H H C C C C H C H C H H N C C H H H H H H
keywords: irc wb97x-d3bj def2-svp def2/J tightscf
charge: 0
multiplicity: 1
formula: C17H29LiN2O4
InChI: InChI=1/C10H10NO.C3H7NO.2C2H6O.Li/c1-11(2)10-5-3-9(4-6-10)7-8-12;1-3-4(2)5;2*1-3-2;/h3-6H,1-2H3;3H,1-2H3;2*1-2H3;/q2*-1;;;+2/rC17H29LiN2O4/c1-9-20(4)22-18(23(5)6,24(7)8)21-15-14-16-10-12-17(13-11-16)19(2)3/h9-13H,1-8H3
53 atoms
N  1.26076 1.429634 -1.439261
O  2.500631 0.964442 -1.166772
C  0.644098 2.20432 -0.543995
C  0.486095 0.587093 -2.32339
H  -0.337161 2.554036 -0.878953
C  1.470451 3.177408 0.248507
H  1.055549 0.415967 -3.24936
H  0.286006 -0.389404 -1.84559
H  -0.471532 1.070183 -2.567382
H  1.94281 3.895328 -0.443422
H  0.835225 3.730007 0.954366
H  2.273327 2.671455 0.801107
C  0.861728 0.543568 1.519159
C  -0.149224 0.977811 0.880965
O  1.927502 0.256361 2.020891
Li 2.859168 -0.184808 0.251023
O  2.255211 -2.003987 -0.084785
O  4.800359 -0.132804 0.530898
C  1.776493 -2.932424 0.867553
H  0.782333 -3.316792 0.57543
H  2.4716 -3.785984 0.970059
H  1.696228 -2.412501 1.831436
C  2.347408 -2.524611 -1.3963
H  1.358751 -2.865192 -1.754099
H  2.708239 -1.718096 -2.048798
H  3.050738 -3.376707 -1.434432
C  5.524397 -0.693439 -0.549157
H  6.604076 -0.732215 -0.317818
H  5.157117 -1.717571 -0.703696
H  5.373862 -0.107544 -1.473633
C  5.231349 1.174345 0.869278
H  5.118885 1.861795 0.012637
H  4.606789 1.525591 1.702457
H  6.288388 1.163857 1.191229
C  -1.53127 0.571034 0.619907
C  -2.535372 1.505252 0.318314
C  -1.918313 -0.782467 0.639368
C  -3.849182 1.121594 0.048641
H  -2.289622 2.571885 0.307446
C  -3.224755 -1.183457 0.376454
H  -1.165451 -1.543893 0.868806
C  -4.230989 -0.239297 0.058136
H  -3.458568 -2.248277 0.414236
H  -4.581928 1.899526 -0.169877
N  -5.527012 -0.632582 -0.23016
C  -6.563463 0.371803 -0.349615
C  -5.916337 -2.010506 -0.013652
H  -7.515117 -0.119538 -0.591965
H  -6.704773 0.954683 0.581814
H  -6.343272 1.084846 -1.161911
H  -6.964237 -2.139935 -0.315331
H  -5.309865 -2.701936 -0.622357
H  -5.822371 -2.322048 1.04538
elementType: N O C H Li
totalener: -1082.73258559227179 hartree
nucrepener: 2105.13992723630645 hartree
electener: -3187.84456561217849 hartree
oneelecener: -5658.53146330420805 hartree
twoeener: 2470.68689769202956 hartree
cpcmener: -0.02493287035505 hartree
kineticenergy: 1069.93127480401017 hartree
exchangeener: -98.002908551932 hartree
energy: -523.7040 -523.6529 -523.2840 -521.1549 -393.7966 -392.6781 -281.6775 -281.3469 -281.0800 -281.0699 -281.0612 -281.0107 -280.8802 -280.4589 -280.4543 -280.2899 -280.0351 -279.7748 -279.7595 -279.6293 -279.6143 -279.5870 -279.0326 -54.5929 -31.8732 -31.7948 -31.7734 -31.2298 -29.0725 -26.4793 -25.7215 -24.2715 -23.7638 -23.6011 -23.1380 -23.0463 -22.6893 -22.5860 -21.4081 -20.8907 -20.6057 -20.5470 -19.4530 -18.7041 -18.0992 -17.4756 -16.5965 -16.4922 -16.3187 -16.2425 -16.1940 -16.1318 -16.1072 -16.0283 -15.9632 -15.7338 -15.5841 -15.5333 -15.2368 -14.9187 -14.4957 -14.2680 -14.1730 -14.1080 -13.7311 -13.6599 -13.6494 -13.5668 -13.4579 -13.3500 -13.2119 -13.1624 -13.0871 -12.9573 -12.8763 -12.7375 -12.5153 -12.2022 -12.0434 -11.9472 -11.6979 -10.9194 -10.4021 -10.3344 -9.7412 -9.3661 -9.0585 -8.6183 -7.3415 -6.6013 1.5728 1.8465 2.0843 2.2256 3.8990 4.0505 4.2714 4.3299 4.3595 4.7207 4.9257 electronvolt
chargesum: -0.0000000
charge: -0.046455 -0.800929 0.025423 0.141355 0.050729 0.073997 0.039967 0.032177 0.038498 0.042459 0.034647 0.052345 0.284205 -0.318934 -0.513486 0.844286 -0.827324 -0.692776 0.255502 0.048069 0.042392 0.068022 0.236605 0.042554 0.068777 0.040509 0.228857 0.041591 0.060321 0.048898 0.220163 0.046889 0.066850 0.041548 0.030509 -0.053054 -0.043521 -0.125630 0.016906 -0.120800 0.004774 0.210422 0.005243 0.006826 -0.401127 0.114735 0.114859 0.043600 0.026529 0.040914 0.043816 0.040881 0.026389
charge: 0.161426 -0.751037 0.121748 0.059611 0.039486 -0.030977 0.037137 0.032958 0.030957 0.041148 0.034112 0.055858 0.245322 -0.228251 -0.452564 0.325197 -0.567373 -0.547190 0.194794 0.044540 0.044860 0.069206 0.193103 0.044561 0.068942 0.043492 0.192845 0.045408 0.064249 0.050667 0.194377 0.050733 0.067509 0.044528 -0.060684 -0.031225 -0.024718 -0.088618 0.033337 -0.086633 0.034441 0.023746 0.032935 0.032712 -0.089083 0.031446 0.031320 0.031556 0.015029 0.023271 0.031625 0.023255 0.014906
qa: -0.0465 -0.8009 0.0254 0.1414 0.0507 0.0740 0.0400 0.0322 0.0385 0.0425 0.0346 0.0523 0.2842 -0.3189 -0.5135 0.8443 -0.8273 -0.6928 0.2555 0.0481 0.0424 0.0680 0.2366 0.0426 0.0688 0.0405 0.2289 0.0416 0.0603 0.0489 0.2202 0.0469 0.0668 0.0415 0.0305 -0.0531 -0.0435 -0.1256 0.0169 -0.1208 0.0048 0.2104 0.0052 0.0068 -0.4011 0.1147 0.1149 0.0436 0.0265 0.0409 0.0438 0.0409 0.0264
va: 3.4769 1.2217 4.0278 3.8844 0.9931 3.8955 0.9895 1.0064 0.9969 0.9953 0.9940 1.0146 3.8352 3.7088 1.8259 0.2331 1.9494 1.9020 3.8377 0.9810 0.9795 0.9923 3.8505 0.9837 0.9972 0.9810 3.8425 0.9817 0.9863 0.9843 3.8387 0.9858 0.9884 0.9812 3.8344 3.8569 3.8762 3.8645 0.9899 3.8534 0.9991 3.7673 0.9978 0.9979 3.2130 3.9328 3.9330 0.9960 0.9862 0.9846 0.9960 0.9845 0.9860
dispersion: -0.108169736 hartree
energy: -1082.840755328595 hartree
dipole: -2.202712971 1.818922166 -0.383790805 -6.481930222 4.854019967 -1.627910254 -8.498087361 7.285775197 -1.212312164
dipolemethod: SCF
magnitude: 2.065693095 au
magnitude: 5.250574577 debye
