program: Orca
programVersion: 6.1.x
elementType: N O C C H C H H H H H H C C O Li O O C H H H C H H H C H H H C H H H C C C C H C H C N O O C N C N
keywords: optts freq wb97x-d3bj def2-svp def2/J tightscf tightopt
charge: 0
multiplicity: 1
frequency: 0.00 0.00 0.00 0.00 0.00 0.00 -482.10 13.83 21.12 26.34 30.77 40.49 43.54 53.46 58.26 64.71 67.43 75.17 77.32 83.15 98.06 116.14 117.17 126.33 134.84 142.91 149.29 157.23 161.64 174.11 192.13 199.41 208.32 212.44 224.57 245.95 249.28 262.44 269.13 285.96 304.27 312.37 339.30 365.05 386.85 390.84 400.42 428.63 432.06 447.39 469.01 475.92 491.97 517.50 527.44 535.55 566.53 601.55 617.06 624.77 652.04 660.15 675.45 707.99 742.13 832.95 852.46 888.58 950.47 956.24 960.51 969.62 972.18 990.31 995.02 1045.06 1073.13 1114.50 1126.35 1126.85 1128.51 1154.20 1161.58 1164.47 1169.05 1203.03 1206.41 1213.13 1219.42 1220.49 1244.09 1277.15 1277.92 1279.42 1302.28 1350.56 1373.84 1415.60 1433.75 1436.13 1438.40 1451.30 1452.49 1453.24 1454.72 1456.97 1457.27 1460.98 1463.75 1466.02 1467.70 1468.81 1471.34 1477.13 1481.35 1485.33 1491.53 1496.30 1557.81 1614.26 1661.28 1670.93 1715.46 2130.38 2432.50 2434.32 3037.50 3040.85 3042.76 3044.15 3047.86 3078.96 3119.65 3126.02 3126.27 3134.33 3144.00 3171.36 3185.55 3186.76 3187.83 3193.14 3195.42 3203.01 3213.11 3246.61 3252.12
frequency: 13.83 21.12 26.34 30.77 40.49 43.54 53.46 58.26 64.71 67.43 75.17 77.32 83.15 98.06 116.14 117.17 126.33 134.84 142.91 149.29 157.23 161.64 174.11 192.13 199.41 208.32 212.44 224.57 245.95 249.28 262.44 269.13 285.96 304.27 312.37 339.30 365.05 386.85 390.84 400.42 428.63 432.06 447.39 469.01 475.92 491.97 517.50 527.44 535.55 566.53 601.55 617.06 624.77 652.04 660.15 675.45 707.99 742.13 832.95 852.46 888.58 950.47 956.24 960.51 969.62 972.18 990.31 995.02 1045.06 1073.13 1114.50 1126.35 1126.85 1128.51 1154.20 1161.58 1164.47 1169.05 1203.03 1206.41 1213.13 1219.42 1220.49 1244.09 1277.15 1277.92 1279.42 1302.28 1350.56 1373.84 1415.60 1433.75 1436.13 1438.40 1451.30 1452.49 1453.24 1454.72 1456.97 1457.27 1460.98 1463.75 1466.02 1467.70 1468.81 1471.34 1477.13 1481.35 1485.33 1491.53 1496.30 1557.81 1614.26 1661.28 1670.93 1715.46 2130.38 2432.50 2434.32 3037.50 3040.85 3042.76 3044.15 3047.86 3078.96 3119.65 3126.02 3126.27 3134.33 3144.00 3171.36 3185.55 3186.76 3187.83 3193.14 3195.42 3203.01 3213.11 3246.61 3252.12
formula: C17H21LiN4O6
InChI: InChI=1/C10H2N3O3.C3H7NO.2C2H6O.Li/c11-5-8-3-7(1-2-14)4-9(6-12)10(8)13(15)16;1-3-4(2)5;2*1-3-2;/h3-4H;3H,1-2H3;2*1-2H3;/q2*-1;;;+2/rC17H21LiN4O6/c1-7-21(2)26-18(27(3)4,28(5)6)25-9-8-14-10-15(12-19)17(22(23)24)16(11-14)13-20/h7,10-11H,1-6H3
49 atoms
N  1.697397 1.66492 -1.282153
O  2.897109 1.100598 -1.03004
C  1.109717 2.379112 -0.316004
C  0.886493 0.947034 -2.24089
H  0.155356 2.815565 -0.627594
C  1.975066 3.239957 0.562287
H  1.460794 0.811455 -3.1692
H  0.61477 -0.048926 -1.844093
H  -0.031881 1.511115 -2.460562
H  2.444056 4.02246 -0.05759
H  1.36887 3.721304 1.341788
H  2.780421 2.657969 1.029848
C  1.307396 0.464528 1.542571
C  0.326907 1.050163 0.955683
O  2.315343 0.048821 2.033619
Li 3.265535 -0.263111 0.150957
O  2.51827 -1.987305 -0.314759
O  5.183187 -0.347025 0.46053
C  2.08385 -3.010006 0.561727
H  1.061641 -3.34057 0.302818
H  2.761997 -3.881284 0.514828
H  2.088573 -2.604198 1.582049
C  2.526168 -2.371171 -1.677863
H  1.509469 -2.643412 -2.013901
H  2.883399 -1.513569 -2.263966
H  3.197209 -3.234241 -1.838898
C  5.909339 -0.844999 -0.649996
H  6.961042 -1.038199 -0.373155
H  5.44272 -1.790915 -0.959213
H  5.883301 -0.13179 -1.493368
C  5.712486 0.863685 0.975685
H  5.683538 1.663235 0.214653
H  5.09633 1.158047 1.836713
H  6.754546 0.719148 1.312486
C  -1.026694 0.621343 0.680513
C  -2.042798 1.551205 0.391121
C  -1.371926 -0.747027 0.664694
C  -3.348066 1.141389 0.102029
H  -1.822915 2.620078 0.400075
C  -2.663944 -1.173062 0.360632
H  -0.609977 -1.496692 0.887038
C  -3.660678 -0.224408 0.077777
N  -5.019505 -0.663531 -0.244357
O  -5.143211 -1.704774 -0.858311
O  -5.940969 0.038595 0.121094
C  -4.314434 2.171842 -0.207201
N  -5.020198 3.051516 -0.461635
C  -2.915863 -2.596504 0.390269
N  -3.033149 -3.745215 0.450448
totalener: -1337.56124617840601 hartree
nucrepener: 2560.18173032217010 hartree
electener: -3897.70551942656812 hartree
oneelecener: -6908.70591356350906 hartree
twoeener: 3011.00039413694094 hartree
cpcmener: -0.03840493193618 hartree
kineticenergy: 1323.45306394945624 hartree
exchangeener: -117.289706990844 hartree
dispersion: -0.111177844 hartree
temp: 298.15 k
press: 1.00 atm
thermalcorrenthalpy: 0.00094421 hartree
totalenthalpy: -1337.26579829 hartree
vibrat: 0.05310887 hartree
rotat: 0.01714829 hartree
transl: 0.02077797 hartree
total: 0.09103513 hartree
totalentropycorr: -0.09103513 hartree
gibbsenthalpy: -1337.35683342 hartree
gibbsminuselec: 0.31559060 hartree
dispersion: -0.112051871 hartree
dispersion: -0.111394827 hartree
dispersion: -0.110880643 hartree
dispersion: -0.110688206 hartree
dispersion: -0.111015580 hartree
dispersion: -0.111154895 hartree
dispersion: -0.111231168 hartree
dispersion: -0.111284874 hartree
dispersion: -0.111313064 hartree
dispersion: -0.111352292 hartree
dispersion: -0.111309624 hartree
dispersion: -0.111323211 hartree
dispersion: -0.111318652 hartree
elementType: N O C H Li
energy: -524.7064 -524.7010 -524.1658 -523.8999 -523.8251 -521.4184 -399.9165 -394.0373 -393.0364 -393.0292 -282.6239 -282.6041 -282.2512 -282.2271 -281.7215 -281.7078 -281.6490 -281.6403 -281.2273 -281.2101 -281.2094 -281.1961 -281.1609 -281.1514 -280.4735 -279.7703 -279.6641 -54.9556 -38.0164 -33.0737 -32.8001 -32.0194 -31.9480 -31.5170 -29.1259 -28.6350 -28.2421 -26.5971 -25.9393 -25.8112 -24.5778 -23.9616 -23.2763 -23.1911 -22.8341 -21.8547 -21.6020 -21.0944 -20.7534 -20.6894 -19.7244 -19.0125 -18.7247 -18.3641 -18.0790 -17.2496 -17.1069 -17.0025 -16.7708 -16.5457 -16.4401 -16.3706 -16.3254 -16.2722 -16.2189 -16.1078 -15.9934 -15.5034 -15.2383 -15.0605 -14.9678 -14.6676 -14.0617 -13.9332 -13.8346 -13.8027 -13.7624 -13.6682 -13.6410 -13.4721 -13.3642 -13.2612 -13.1527 -13.1430 -12.9400 -12.8076 -12.6896 -12.3839 -12.2623 -12.2018 -12.1441 -11.8538 -11.8403 -11.2417 -10.5606 -10.5195 -10.3814 -10.1829 -9.3186 -8.5485 -7.1640 -1.0625 -0.0267 1.0085 1.3140 1.5286 2.8060 2.9030 3.2529 3.6953 3.7844 4.0861 electronvolt
chargesum: -0.0000000
charge: -0.045328 -0.790113 0.033553 0.134755 0.057291 0.072868 0.047520 0.036306 0.041585 0.048331 0.038152 0.055267 0.329399 -0.332695 -0.427855 0.822889 -0.826603 -0.690205 0.251392 0.050903 0.047750 0.068359 0.231739 0.046629 0.070673 0.044846 0.225888 0.045825 0.064170 0.050672 0.217524 0.048473 0.066321 0.045336 0.069069 0.011869 0.033104 -0.157675 0.056697 -0.151226 0.044499 0.261305 0.252911 -0.284471 -0.283428 -0.030901 0.014611 -0.030796 0.012815
charge: 0.161592 -0.743416 0.120021 0.059325 0.042340 -0.030805 0.040443 0.033209 0.032355 0.043552 0.035809 0.054472 0.295505 -0.238966 -0.384845 0.335069 -0.571041 -0.549851 0.195566 0.046043 0.047299 0.068962 0.194729 0.046536 0.069170 0.045739 0.193559 0.047409 0.065547 0.050200 0.195174 0.050614 0.067392 0.046582 0.030807 0.032695 0.045240 -0.027098 0.060505 -0.031155 0.062297 0.060728 0.467360 -0.385914 -0.384582 0.036172 -0.083271 0.036397 -0.085466
qa: -0.0453 -0.7901 0.0336 0.1348 0.0573 0.0729 0.0475 0.0363 0.0416 0.0483 0.0382 0.0553 0.3294 -0.3327 -0.4279 0.8229 -0.8266 -0.6902 0.2514 0.0509 0.0477 0.0684 0.2317 0.0466 0.0707 0.0448 0.2259 0.0458 0.0642 0.0507 0.2175 0.0485 0.0663 0.0453 0.0691 0.0119 0.0331 -0.1577 0.0567 -0.1512 0.0445 0.2613 0.2529 -0.2845 -0.2834 -0.0309 0.0146 -0.0308 0.0128
va: 3.4713 1.2305 4.0089 3.8852 0.9894 3.8969 0.9899 1.0032 0.9959 0.9957 0.9941 1.0102 3.8554 3.7068 1.9694 0.2853 1.9431 1.8990 3.8345 0.9824 0.9800 0.9916 3.8470 0.9835 0.9973 0.9818 3.8421 0.9820 0.9869 0.9830 3.8385 0.9852 0.9889 0.9824 3.8958 3.8615 3.8844 4.0597 0.9988 4.0550 1.0114 3.7720 3.8428 1.8083 1.8104 4.0484 3.1430 4.0436 3.1391
dispersion: -0.111314951 hartree
energy: -1337.675404653876 hartree
dipole: 51.554793180 -46.128435130 5.426358050 0.246729011 -0.421998884 -0.175269873 -7.559974525 7.227546018 -0.332428507
dipolemethod: SCF
magnitude: 5.439355654 au
magnitude: 13.825743322 debye
zeropoint: 0.37528103 hartree
thermalvibcorrection: 0.02948789 hartree
thermalrotcorrection: 0.00141627 hartree
thermaltrasncorrection: 0.00141627 hartree
thermaltotal: -1337.26780319 hartree
thermalcorr: 0.03232043 hartree
nonthermalcorr: 0.37528103 hartree
totalcorr: 0.40760146 hartree
totalenthalpy: -1337.26685898 hartree
vibrat: 0.05493214 hartree
rotat: 0.01713648 hartree
total: 0.09284659 hartree
