program: Orca
programVersion: 6.1.x
elementType: N O C C H C H H H H H H C C O Li O O C H H H C H H H C H H H C H H H C C C C H C H C H H O C H H H
keywords: optts freq wb97x-d3bj def2-svp def2/J tightscf tightopt slowconv
charge: 0
multiplicity: 1
frequency: 0.00 0.00 0.00 0.00 0.00 0.00 -457.15 15.38 22.39 28.36 35.86 38.68 45.33 52.51 64.36 73.56 78.02 85.83 97.28 109.33 116.13 122.07 133.20 140.23 152.32 162.11 198.29 205.67 207.95 224.66 229.11 244.20 251.63 260.37 267.13 280.52 283.23 294.16 366.08 389.88 393.51 405.99 412.84 437.67 442.74 452.67 502.30 511.51 526.42 554.51 556.49 590.07 616.85 627.10 656.79 728.70 760.32 840.72 852.73 860.67 876.27 955.50 971.19 976.16 994.56 1017.13 1029.94 1038.79 1060.45 1080.68 1117.75 1125.48 1129.26 1129.90 1130.66 1158.99 1165.11 1171.60 1175.52 1180.12 1197.82 1203.49 1207.02 1212.12 1212.73 1222.99 1239.94 1276.60 1279.22 1294.00 1316.58 1338.38 1370.85 1415.54 1431.00 1435.12 1437.76 1451.02 1451.93 1452.38 1453.51 1456.23 1460.43 1463.00 1463.85 1464.13 1464.62 1464.82 1465.73 1466.65 1469.16 1476.12 1478.52 1484.30 1490.53 1497.73 1584.89 1621.24 1663.54 1717.51 2150.53 3034.84 3038.57 3041.79 3043.80 3045.56 3050.04 3074.95 3115.65 3122.14 3123.11 3130.82 3140.24 3142.31 3167.03 3183.27 3187.50 3188.10 3194.19 3195.27 3195.58 3199.39 3207.67 3209.51 3213.06 3227.92 3248.87
frequency: 15.38 22.39 28.36 35.86 38.68 45.33 52.51 64.36 73.56 78.02 85.83 97.28 109.33 116.13 122.07 133.20 140.23 152.32 162.11 198.29 205.67 207.95 224.66 229.11 244.20 251.63 260.37 267.13 280.52 283.23 294.16 366.08 389.88 393.51 405.99 412.84 437.67 442.74 452.67 502.30 511.51 526.42 554.51 556.49 590.07 616.85 627.10 656.79 728.70 760.32 840.72 852.73 860.67 876.27 955.50 971.19 976.16 994.56 1017.13 1029.94 1038.79 1060.45 1080.68 1117.75 1125.48 1129.26 1129.90 1130.66 1158.99 1165.11 1171.60 1175.52 1180.12 1197.82 1203.49 1207.02 1212.12 1212.73 1222.99 1239.94 1276.60 1279.22 1294.00 1316.58 1338.38 1370.85 1415.54 1431.00 1435.12 1437.76 1451.02 1451.93 1452.38 1453.51 1456.23 1460.43 1463.00 1463.85 1464.13 1464.62 1464.82 1465.73 1466.65 1469.16 1476.12 1478.52 1484.30 1490.53 1497.73 1584.89 1621.24 1663.54 1717.51 2150.53 3034.84 3038.57 3041.79 3043.80 3045.56 3050.04 3074.95 3115.65 3122.14 3123.11 3130.82 3140.24 3142.31 3167.03 3183.27 3187.50 3188.10 3194.19 3195.27 3195.58 3199.39 3207.67 3209.51 3213.06 3227.92 3248.87
formula: C16H26LiNO5
InChI: InChI=1/C9H7O2.C3H7NO.2C2H6O.Li/c1-11-9-4-2-8(3-5-9)6-7-10;1-3-4(2)5;2*1-3-2;/h2-5H,1H3;3H,1-2H3;2*1-2H3;/q2*-1;;;+2/rC16H26LiNO5/c1-8-18(2)21-17(22(4)5,23(6)7)20-14-13-15-9-11-16(19-3)12-10-15/h8-12H,1-7H3
49 atoms
N  0.869737 1.361428 -1.487412
O  2.159339 1.111741 -1.168562
C  0.119218 2.076153 -0.645732
C  0.254611 0.354516 -2.323591
H  -0.895755 2.25189 -1.01549
C  0.76774 3.203387 0.107177
H  0.869246 0.208514 -3.22434
H  0.188727 -0.605968 -1.779782
H  -0.756848 0.670483 -2.61861
H  1.142786 3.949717 -0.613656
H  0.038704 3.686902 0.77193
H  1.623616 2.852893 0.699238
C  0.541039 0.536914 1.490656
C  -0.509244 0.823327 0.831317
O  1.624406 0.396847 2.012336
Li 2.669641 0.062243 0.274979
O  2.380475 -1.838367 -0.02617
O  4.560506 0.44618 0.613323
C  1.905979 -2.792017 0.903708
H  0.958562 -3.241585 0.554643
H  2.64765 -3.59772 1.054586
H  1.733841 -2.274691 1.856805
C  2.604436 -2.365265 -1.319554
H  1.67738 -2.80312 -1.732029
H  2.928863 -1.538385 -1.965701
H  3.386014 -3.146621 -1.29623
C  5.423524 -0.037318 -0.39977
H  6.481054 0.101142 -0.111265
H  5.226848 -1.111414 -0.523661
H  5.240699 0.481619 -1.357938
C  4.759939 1.818755 0.90537
H  4.579238 2.44293 0.012799
H  4.048632 2.098069 1.695093
H  5.788526 1.992784 1.269646
C  -1.843207 0.260983 0.620696
C  -2.939727 1.073845 0.302228
C  -2.074581 -1.130101 0.707999
C  -4.216724 0.542491 0.080159
H  -2.804258 2.157552 0.235569
C  -3.334995 -1.670763 0.494249
H  -1.236335 -1.792472 0.945684
C  -4.420047 -0.837123 0.175155
H  -3.501257 -2.749207 0.565923
H  -5.03812 1.219161 -0.160779
O  -5.618486 -1.451751 -0.023266
C  -6.740143 -0.650154 -0.346256
H  -6.585598 -0.102387 -1.291945
H  -7.590425 -1.335324 -0.463903
H  -6.966874 0.069751 0.459083
totalener: -1063.27656965857250 hartree
nucrepener: 1956.73725716619492 hartree
electener: -3019.98864054727801 hartree
oneelecener: -5338.10740801331303 hartree
twoeener: 2318.11876746603502 hartree
cpcmener: -0.02311434524693 hartree
kineticenergy: 1051.00727204157283 hartree
exchangeener: -95.164664157678 hartree
dispersion: -0.098816185 hartree
temp: 298.15 k
press: 1.00 atm
thermalcorrenthalpy: 0.00094421 hartree
totalenthalpy: -1062.93876663 hartree
vibrat: 0.04715942 hartree
rotat: 0.01667277 hartree
transl: 0.02051560 hartree
total: 0.08434779 hartree
totalentropycorr: -0.08434779 hartree
gibbsenthalpy: -1063.02311442 hartree
gibbsminuselec: 0.35227142 hartree
dispersion: -0.098882393 hartree
dispersion: -0.099014705 hartree
dispersion: -0.099748054 hartree
dispersion: -0.098815508 hartree
dispersion: -0.099389634 hartree
dispersion: -0.099203296 hartree
dispersion: -0.099410865 hartree
dispersion: -0.099662685 hartree
dispersion: -0.099372767 hartree
dispersion: -0.099455451 hartree
dispersion: -0.099542642 hartree
dispersion: -0.099658734 hartree
dispersion: -0.099601896 hartree
dispersion: -0.099608052 hartree
dispersion: -0.099619409 hartree
dispersion: -0.099540200 hartree
dispersion: -0.099452880 hartree
dispersion: -0.099357042 hartree
dispersion: -0.099302458 hartree
dispersion: -0.099229447 hartree
dispersion: -0.099264716 hartree
dispersion: -0.099266772 hartree
dispersion: -0.099295023 hartree
dispersion: -0.099223674 hartree
dispersion: -0.099226851 hartree
dispersion: -0.099210680 hartree
dispersion: -0.099240392 hartree
dispersion: -0.099225369 hartree
dispersion: -0.099238265 hartree
dispersion: -0.099262503 hartree
dispersion: -0.099246329 hartree
dispersion: -0.099239635 hartree
elementType: N O C H Li
energy: -523.8527 -523.7283 -523.6709 -523.3741 -521.1821 -393.8273 -281.7947 -281.5078 -281.3825 -281.1583 -281.0951 -281.0915 -281.0801 -281.0232 -280.3163 -280.2826 -279.9262 -279.9073 -279.8628 -279.8243 -279.6137 -279.1037 -54.6255 -32.3094 -31.9214 -31.8512 -31.8115 -31.2682 -26.7918 -25.7679 -24.4888 -23.8372 -23.7333 -23.1534 -23.0610 -22.8840 -21.8414 -21.4306 -20.6256 -20.5636 -19.7772 -19.2314 -18.1589 -17.6693 -16.8377 -16.5338 -16.4076 -16.2665 -16.2161 -16.1971 -16.1522 -16.1276 -16.0098 -15.8292 -15.7911 -15.6213 -15.2705 -14.9606 -14.5072 -14.3433 -14.3124 -14.0233 -13.7505 -13.6750 -13.5874 -13.5023 -13.3967 -13.2493 -13.1687 -13.0949 -12.9892 -12.6034 -12.5090 -12.2348 -12.0576 -12.0064 -11.7792 -11.5992 -10.4161 -10.3654 -10.1005 -9.5178 -9.1490 -9.0829 -7.7295 -6.7869 1.5495 1.7621 1.9553 2.0713 3.8892 4.0503 4.2490 4.3186 4.3752 4.6590 4.9065 electronvolt
chargesum: -0.0000000
charge: -0.046536 -0.797432 0.031375 0.138898 0.050106 0.074515 0.040753 0.034721 0.038795 0.043056 0.034835 0.052592 0.295994 -0.334159 -0.507761 0.846418 -0.824938 -0.697584 0.251531 0.049772 0.041783 0.069436 0.236442 0.042918 0.070018 0.041261 0.227817 0.042123 0.061693 0.048092 0.220639 0.047024 0.066112 0.041459 0.042916 -0.057963 -0.034764 -0.106154 0.023244 -0.050830 0.009692 0.251405 0.022657 0.020509 -0.517643 0.201930 0.049635 0.063702 0.049895
charge: 0.161296 -0.749419 0.121970 0.059922 0.039175 -0.031138 0.037815 0.033347 0.031077 0.041295 0.034014 0.054931 0.250990 -0.230541 -0.444923 0.327986 -0.566868 -0.547387 0.195024 0.044856 0.045150 0.069147 0.193502 0.044596 0.068524 0.044051 0.192657 0.045618 0.064508 0.049852 0.194939 0.050691 0.067453 0.044664 -0.041577 -0.028530 -0.020240 -0.056071 0.035950 -0.025322 0.036757 0.131427 0.052359 0.045224 -0.495669 0.178413 0.043975 0.060395 0.044132
qa: -0.0465 -0.7974 0.0314 0.1389 0.0501 0.0745 0.0408 0.0347 0.0388 0.0431 0.0348 0.0526 0.2960 -0.3342 -0.5078 0.8464 -0.8249 -0.6976 0.2515 0.0498 0.0418 0.0694 0.2364 0.0429 0.0700 0.0413 0.2278 0.0421 0.0617 0.0481 0.2206 0.0470 0.0661 0.0415 0.0429 -0.0580 -0.0348 -0.1062 0.0232 -0.0508 0.0097 0.2514 0.0227 0.0205 -0.5176 0.2019 0.0496 0.0637 0.0499
va: 3.4786 1.2264 4.0213 3.8834 0.9935 3.8953 0.9902 1.0065 0.9965 0.9954 0.9940 1.0140 3.8438 3.7179 1.8455 0.2336 1.9629 1.9081 3.8400 0.9811 0.9802 0.9918 3.8494 0.9843 0.9956 0.9810 3.8427 0.9818 0.9853 0.9838 3.8391 0.9856 0.9892 0.9815 3.8419 3.8564 3.8495 3.8263 0.9906 3.8262 1.0012 3.7841 0.9911 0.9991 1.9614 3.8613 0.9811 0.9775 0.9811
dispersion: -0.099241259 hartree
energy: -1063.376031993264 hartree
dipole: 9.415497917 -8.915827401 0.499670516 -1.100847969 0.404932692 -0.695915276 -8.840443208 7.613432533 -1.227010675
dipolemethod: SCF
magnitude: 1.496503890 au
magnitude: 3.803810595 debye
zeropoint: 0.40760114 hartree
thermalvibcorrection: 0.02588131 hartree
thermalrotcorrection: 0.00141627 hartree
thermaltrasncorrection: 0.00141627 hartree
thermaltotal: -1062.93971700 hartree
thermalcorr: 0.02871386 hartree
nonthermalcorr: 0.40760114 hartree
totalcorr: 0.43631500 hartree
totalenthalpy: -1062.93877279 hartree
vibrat: 0.04806275 hartree
rotat: 0.01665551 hartree
total: 0.08523386 hartree
