program: Orca
programVersion: 6.1.x
elementType: N O C C H C H H H H H H C C O Li O O C H H H C H H H C H H H C H H H C C C C H C H C H H C N
keywords: optts freq wb97x-d3bj def2-svp def2/J tightscf tightopt slowconv
charge: 0
multiplicity: 1
frequency: 0.00 0.00 0.00 0.00 0.00 0.00 -467.03 11.78 26.01 27.42 33.33 41.50 44.19 53.89 63.25 71.07 78.87 88.88 94.13 105.49 115.42 127.38 135.97 143.97 155.00 163.46 195.80 201.46 207.12 222.34 231.90 243.06 265.11 272.03 276.40 293.01 299.07 367.89 381.63 401.47 413.06 422.84 439.36 452.93 476.60 511.08 531.49 556.04 576.77 585.49 589.24 608.51 617.55 662.95 721.13 767.31 827.53 860.39 872.45 885.03 955.47 970.71 980.87 1019.37 1029.85 1037.73 1041.58 1061.06 1119.85 1125.57 1128.75 1129.49 1137.27 1160.22 1164.66 1168.40 1185.09 1192.32 1203.36 1206.40 1212.26 1222.67 1240.78 1250.82 1276.10 1278.92 1314.07 1325.86 1372.30 1415.90 1431.79 1435.96 1438.04 1449.91 1451.57 1452.57 1453.93 1457.73 1458.70 1461.58 1464.21 1464.54 1466.34 1468.41 1470.10 1471.39 1482.50 1489.40 1495.25 1583.75 1619.32 1640.29 1699.21 2136.07 2407.76 3035.60 3039.64 3042.46 3043.32 3046.93 3076.13 3117.25 3123.52 3124.23 3132.82 3142.60 3168.78 3183.53 3186.91 3187.38 3193.36 3194.80 3202.22 3215.02 3218.69 3224.14 3236.22 3239.01
frequency: 11.78 26.01 27.42 33.33 41.50 44.19 53.89 63.25 71.07 78.87 88.88 94.13 105.49 115.42 127.38 135.97 143.97 155.00 163.46 195.80 201.46 207.12 222.34 231.90 243.06 265.11 272.03 276.40 293.01 299.07 367.89 381.63 401.47 413.06 422.84 439.36 452.93 476.60 511.08 531.49 556.04 576.77 585.49 589.24 608.51 617.55 662.95 721.13 767.31 827.53 860.39 872.45 885.03 955.47 970.71 980.87 1019.37 1029.85 1037.73 1041.58 1061.06 1119.85 1125.57 1128.75 1129.49 1137.27 1160.22 1164.66 1168.40 1185.09 1192.32 1203.36 1206.40 1212.26 1222.67 1240.78 1250.82 1276.10 1278.92 1314.07 1325.86 1372.30 1415.90 1431.79 1435.96 1438.04 1449.91 1451.57 1452.57 1453.93 1457.73 1458.70 1461.58 1464.21 1464.54 1466.34 1468.41 1470.10 1471.39 1482.50 1489.40 1495.25 1583.75 1619.32 1640.29 1699.21 2136.07 2407.76 3035.60 3039.64 3042.46 3043.32 3046.93 3076.13 3117.25 3123.52 3124.23 3132.82 3142.60 3168.78 3183.53 3186.91 3187.38 3193.36 3194.80 3202.22 3215.02 3218.69 3224.14 3236.22 3239.01
formula: C16H23LiN2O4
InChI: InChI=1/C9H4NO.C3H7NO.2C2H6O.Li/c10-7-9-3-1-8(2-4-9)5-6-11;1-3-4(2)5;2*1-3-2;/h1-4H;3H,1-2H3;2*1-2H3;/q2*-1;;;+2/rC16H23LiN2O4/c1-7-19(2)21-17(22(3)4,23(5)6)20-13-12-15-8-10-16(14-18)11-9-15/h7-11H,1-6H3
46 atoms
N  0.842733 1.371322 -1.47354
O  2.06638 0.905011 -1.142569
C  0.197102 2.161653 -0.61165
C  0.092672 0.511193 -2.36218
H  -0.769591 2.508386 -0.989319
C  0.996501 3.152572 0.187328
H  0.694476 0.307158 -3.260259
H  -0.136376 -0.448844 -1.863578
H  -0.848916 0.997679 -2.656607
H  1.471774 3.869359 -0.503622
H  0.341437 3.7045 0.875255
H  1.795403 2.661384 0.758574
C  0.387677 0.491525 1.464886
C  -0.601566 0.955486 0.802237
O  1.417711 0.183147 2.005815
Li 2.425357 -0.26779 0.24328
O  1.807083 -2.078282 -0.081005
O  4.344837 -0.20902 0.591702
C  1.345214 -3.012143 0.875341
H  0.354486 -3.409055 0.588753
H  2.05188 -3.856313 0.974389
H  1.26455 -2.493275 1.839732
C  1.91537 -2.605496 -1.389607
H  0.93314 -2.957678 -1.753319
H  2.274608 -1.79973 -2.043947
H  2.627593 -3.450333 -1.416391
C  5.114997 -0.801448 -0.439162
H  6.179384 -0.856821 -0.148719
H  4.735928 -1.820769 -0.597581
H  5.026999 -0.22813 -1.379553
C  4.776372 1.099205 0.927476
H  4.709281 1.773465 0.055762
H  4.120531 1.471539 1.726855
H  5.817875 1.081823 1.295699
C  -1.971823 0.523671 0.571449
C  -2.970197 1.441655 0.187142
C  -2.338694 -0.834754 0.708403
C  -4.276404 1.027636 -0.05275
H  -2.72011 2.501125 0.089951
C  -3.639867 -1.256946 0.475731
H  -1.575662 -1.563233 0.997034
C  -4.619628 -0.325514 0.088623
H  -3.905026 -2.311421 0.587047
H  -5.038475 1.754183 -0.345929
C  -5.971371 -0.759559 -0.1606
N  -7.057728 -1.109693 -0.360837
totalener: -1041.00025120815553 hartree
nucrepener: 1884.57748085073217 hartree
electener: -2925.55083051281781 hartree
oneelecener: -5160.45228245171347 hartree
twoeener: 2234.90145193889566 hartree
cpcmener: -0.02638443975835 hartree
kineticenergy: 1028.94803565030952 hartree
exchangeener: -93.423929140652 hartree
dispersion: -0.097251811 hartree
temp: 298.15 k
press: 1.00 atm
thermalcorrenthalpy: 0.00094421 hartree
totalenthalpy: -1040.69616979 hartree
vibrat: 0.04421112 hartree
rotat: 0.01663128 hartree
transl: 0.02049317 hartree
total: 0.08133558 hartree
totalentropycorr: -0.08133558 hartree
gibbsenthalpy: -1040.77750536 hartree
gibbsminuselec: 0.31999765 hartree
dispersion: -0.097496591 hartree
dispersion: -0.097283307 hartree
dispersion: -0.097599709 hartree
dispersion: -0.097477891 hartree
dispersion: -0.097458778 hartree
dispersion: -0.097627963 hartree
dispersion: -0.097571118 hartree
dispersion: -0.097600765 hartree
dispersion: -0.097528879 hartree
dispersion: -0.097535773 hartree
dispersion: -0.097602228 hartree
dispersion: -0.097659461 hartree
dispersion: -0.097601003 hartree
dispersion: -0.097596388 hartree
dispersion: -0.097567278 hartree
dispersion: -0.097579236 hartree
dispersion: -0.097591997 hartree
elementType: N O C H Li
energy: -523.8019 -523.7425 -523.7357 -521.2862 -393.9173 -392.5233 -282.1674 -281.4914 -281.2004 -281.1580 -281.1434 -281.1324 -281.0813 -280.9753 -280.9046 -280.5229 -280.5062 -280.3807 -280.1470 -280.1270 -279.6822 -279.3157 -54.7734 -32.3146 -31.9398 -31.8744 -31.3749 -28.2039 -27.2757 -25.9006 -25.0769 -24.0625 -23.9644 -23.2145 -23.1226 -23.1004 -21.5050 -20.7116 -20.6818 -20.6204 -20.0752 -18.3384 -18.1549 -17.2359 -16.6360 -16.5046 -16.3394 -16.2908 -16.2416 -16.2047 -16.1470 -16.0826 -15.9852 -15.7217 -15.3597 -15.0828 -14.7019 -14.6177 -14.5189 -14.1663 -13.8361 -13.7427 -13.7012 -13.5990 -13.4961 -13.2887 -13.1838 -13.0599 -12.9952 -12.8177 -12.7385 -12.5444 -12.2915 -12.1449 -12.0672 -11.9956 -10.6268 -10.4856 -10.4178 -9.8618 -9.7397 -9.1871 -8.1114 -6.9809 0.6561 1.4791 1.6030 1.7514 3.4909 3.7665 3.9150 4.1154 4.1916 4.3595 4.5413 electronvolt
chargesum: 0.0000000
charge: -0.045765 -0.796398 0.033609 0.137283 0.053348 0.072750 0.043716 0.034325 0.039974 0.045264 0.036520 0.053917 0.315910 -0.336657 -0.471314 0.834479 -0.830045 -0.692283 0.255290 0.048419 0.044738 0.068458 0.235443 0.044280 0.069724 0.042725 0.227404 0.043779 0.062692 0.049824 0.218509 0.048097 0.066401 0.043401 0.066542 -0.062094 -0.047278 0.048105 0.035123 0.048795 0.024378 -0.197921 0.032715 0.034765 -0.037574 -0.043375
charge: 0.161628 -0.747167 0.121124 0.059598 0.040559 -0.031060 0.038830 0.033238 0.031662 0.042194 0.034946 0.054643 0.274435 -0.236007 -0.417007 0.329562 -0.568912 -0.548337 0.195319 0.045332 0.045926 0.069117 0.193852 0.045481 0.069115 0.044556 0.193144 0.046461 0.064893 0.050373 0.195016 0.051015 0.067381 0.045520 0.012388 -0.038871 -0.030669 0.012372 0.041125 0.009069 0.042199 -0.108969 0.048320 0.048585 0.007635 -0.139612
qa: -0.0458 -0.7964 0.0336 0.1373 0.0533 0.0727 0.0437 0.0343 0.0400 0.0453 0.0365 0.0539 0.3159 -0.3367 -0.4713 0.8345 -0.8300 -0.6923 0.2553 0.0484 0.0447 0.0685 0.2354 0.0443 0.0697 0.0427 0.2274 0.0438 0.0627 0.0498 0.2185 0.0481 0.0664 0.0434 0.0665 -0.0621 -0.0473 0.0481 0.0351 0.0488 0.0244 -0.1979 0.0327 0.0348 -0.0376 -0.0434
va: 3.4763 1.2259 4.0151 3.8844 0.9919 3.8966 0.9900 1.0048 0.9966 0.9955 0.9939 1.0122 3.8479 3.7122 1.8986 0.2609 1.9526 1.9030 3.8370 0.9811 0.9798 0.9919 3.8483 0.9835 0.9974 0.9814 3.8422 0.9818 0.9863 0.9837 3.8381 0.9855 0.9889 0.9818 3.8833 3.8522 3.8696 3.8793 0.9909 3.8671 0.9998 3.8675 0.9913 0.9912 4.0609 3.1331
dispersion: -0.097591871 hartree
energy: -1041.103117276888 hartree
dipole: 27.225338317 -23.859695295 3.365643022 -2.270764531 1.558486386 -0.712278145 -7.329845044 6.667822821 -0.662022223
dipolemethod: SCF
magnitude: 3.503307942 au
magnitude: 8.904701120 debye
zeropoint: 0.37355038 hartree
thermalvibcorrection: 0.02517499 hartree
thermalrotcorrection: 0.00141627 hartree
thermaltrasncorrection: 0.00141627 hartree
thermaltotal: -1040.70155936 hartree
thermalcorr: 0.02800754 hartree
nonthermalcorr: 0.37355038 hartree
totalcorr: 0.40155792 hartree
totalenthalpy: -1040.70061515 hartree
vibrat: 0.04696674 hartree
rotat: 0.01661666 hartree
total: 0.08407658 hartree
