program: Orca
programVersion: 6.1.x
elementType: N O C C H C H H H H H H C C O Li O O C H H H C H H H C H H H C H H H C C C C H C H C F F F
keywords: opt freq wb97x-d3bj def2-svp def2/J tightscf tightopt
charge: 0
multiplicity: 1
frequency: 0.00 0.00 0.00 0.00 0.00 0.00 -56.84 11.79 21.33 29.73 37.62 38.86 53.78 64.53 73.06 78.15 86.37 91.41 112.36 116.32 123.74 141.87 143.66 164.61 178.54 192.16 208.83 213.08 229.77 237.93 242.86 261.75 265.42 269.46 274.55 290.14 311.18 318.98 329.20 361.88 394.69 407.06 423.94 433.67 474.49 523.53 533.28 534.20 548.75 564.16 591.23 607.34 650.06 654.87 678.59 687.13 749.22 774.74 843.04 871.35 876.35 891.38 961.84 971.12 1018.86 1042.49 1059.68 1084.45 1090.64 1126.99 1129.37 1129.64 1157.18 1169.12 1172.58 1193.94 1206.78 1212.18 1219.20 1219.25 1219.95 1240.79 1277.83 1281.66 1282.44 1283.58 1314.20 1326.06 1356.89 1382.57 1409.03 1425.48 1441.16 1444.45 1450.67 1451.84 1453.12 1455.76 1457.14 1463.39 1464.38 1465.09 1466.86 1468.84 1469.86 1472.32 1486.27 1494.90 1510.27 1516.23 1601.10 1699.53 1736.24 2141.09 2986.74 3037.27 3041.69 3044.10 3048.37 3064.88 3103.69 3113.17 3121.11 3126.87 3127.87 3133.16 3151.31 3157.30 3177.11 3189.53 3191.96 3194.93 3195.77 3230.86 3256.52
frequency: 11.79 21.33 29.73 37.62 38.86 53.78 64.53 73.06 78.15 86.37 91.41 112.36 116.32 123.74 141.87 143.66 164.61 178.54 192.16 208.83 213.08 229.77 237.93 242.86 261.75 265.42 269.46 274.55 290.14 311.18 318.98 329.20 361.88 394.69 407.06 423.94 433.67 474.49 523.53 533.28 534.20 548.75 564.16 591.23 607.34 650.06 654.87 678.59 687.13 749.22 774.74 843.04 871.35 876.35 891.38 961.84 971.12 1018.86 1042.49 1059.68 1084.45 1090.64 1126.99 1129.37 1129.64 1157.18 1169.12 1172.58 1193.94 1206.78 1212.18 1219.20 1219.25 1219.95 1240.79 1277.83 1281.66 1282.44 1283.58 1314.20 1326.06 1356.89 1382.57 1409.03 1425.48 1441.16 1444.45 1450.67 1451.84 1453.12 1455.76 1457.14 1463.39 1464.38 1465.09 1466.86 1468.84 1469.86 1472.32 1486.27 1494.90 1510.27 1516.23 1601.10 1699.53 1736.24 2141.09 2986.74 3037.27 3041.69 3044.10 3048.37 3064.88 3103.69 3113.17 3121.11 3126.87 3127.87 3133.16 3151.31 3157.30 3177.11 3189.53 3191.96 3194.93 3195.77 3230.86 3256.52
formula: C15H21F3LiNO4
InChI: InChI=1/C11H9F3NO2.2C2H6O.Li/c1-6(15(2)17)8(5-16)7-3-9(12)11(14)10(13)4-7;2*1-3-2;/h3-4,6H,1-2H3;2*1-2H3;/q-1;;;+1/rC15H21F3LiNO4/c1-10(20(2)22-19(23(3)4)24(5)6)12(9-21)11-7-13(16)15(18)14(17)8-11/h7-8,10H,1-6H3
45 atoms
N  0.931329 1.619651 -1.785184
O  2.009078 1.289713 -0.976855
C  -0.175924 1.943218 -0.907594
C  0.631376 0.511464 -2.67162
H  -1.080386 2.00744 -1.532683
C  0.045052 3.286349 -0.215502
H  1.485343 0.354258 -3.349216
H  0.448704 -0.436752 -2.121609
H  -0.256075 0.744551 -3.283051
H  0.152339 4.087239 -0.964898
H  -0.80184 3.533327 0.444221
H  0.962027 3.246428 0.390826
C  0.586944 0.234163 0.752102
C  -0.426796 0.823777 0.125764
O  1.48331 -0.287183 1.30592
Li 3.030269 -0.108165 -0.58508
O  3.127872 -1.939369 -1.129733
O  4.527712 0.286259 0.543854
C  2.978455 -2.983342 -0.183241
H  1.973057 -3.435313 -0.255172
H  3.74092 -3.76614 -0.343989
H  3.107136 -2.553854 0.819196
C  3.016105 -2.37027 -2.474933
H  2.01385 -2.790215 -2.673066
H  3.179238 -1.498862 -3.123648
H  3.77916 -3.136301 -2.700563
C  5.523287 -0.598754 1.018111
H  5.283738 -0.953154 2.037229
H  5.564234 -1.458084 0.334425
H  6.510908 -0.103796 1.034209
C  4.38726 1.466072 1.318758
H  5.320259 2.057261 1.298656
H  3.569485 2.049045 0.872423
H  4.138994 1.218925 2.366319
C  -1.800432 0.424957 0.514022
C  -2.900345 1.247306 0.211678
C  -2.040498 -0.784745 1.197747
C  -4.181591 0.863232 0.586186
H  -2.790478 2.203088 -0.302107
C  -3.328578 -1.136402 1.566754
H  -1.233618 -1.479592 1.444455
C  -4.421488 -0.325082 1.267309
F  -3.554513 -2.285779 2.213345
F  -5.660481 -0.681467 1.620851
F  -5.226516 1.647764 0.297621
totalener: -1246.29372567161431 hartree
nucrepener: 2127.60923458363004 hartree
electener: -3373.88031553273277 hartree
oneelecener: -5937.79102725391658 hartree
twoeener: 2563.91071172118382 hartree
cpcmener: -0.02288269895248 hartree
kineticenergy: 1233.71874778634287 hartree
exchangeener: -106.534207019938 hartree
dispersion: -0.093362120 hartree
dispersion: -0.093218529 hartree
dispersion: -0.093126089 hartree
dispersion: -0.092986382 hartree
dispersion: -0.092872532 hartree
dispersion: -0.092555133 hartree
dispersion: -0.092331518 hartree
dispersion: -0.092159677 hartree
dispersion: -0.092015969 hartree
dispersion: -0.092009327 hartree
dispersion: -0.092096748 hartree
dispersion: -0.092045548 hartree
dispersion: -0.092044866 hartree
dispersion: -0.092026821 hartree
dispersion: -0.092007462 hartree
dispersion: -0.091956037 hartree
dispersion: -0.091924314 hartree
dispersion: -0.091889130 hartree
dispersion: -0.091885458 hartree
dispersion: -0.091907513 hartree
dispersion: -0.091939931 hartree
dispersion: -0.091964815 hartree
dispersion: -0.092001388 hartree
dispersion: -0.092047283 hartree
dispersion: -0.092167079 hartree
dispersion: -0.092244478 hartree
dispersion: -0.092167732 hartree
dispersion: -0.092158436 hartree
dispersion: -0.092141336 hartree
dispersion: -0.092127276 hartree
dispersion: -0.092084049 hartree
dispersion: -0.092059088 hartree
dispersion: -0.092033506 hartree
dispersion: -0.092028217 hartree
dispersion: -0.092027612 hartree
dispersion: -0.092032853 hartree
dispersion: -0.092036863 hartree
dispersion: -0.092055558 hartree
dispersion: -0.092051567 hartree
dispersion: -0.092060381 hartree
dispersion: -0.092081085 hartree
dispersion: -0.092085891 hartree
dispersion: -0.092118441 hartree
dispersion: -0.092230172 hartree
dispersion: -0.092300092 hartree
dispersion: -0.092556510 hartree
dispersion: -0.092401378 hartree
dispersion: -0.092330362 hartree
dispersion: -0.092413796 hartree
dispersion: -0.092453448 hartree
dispersion: -0.092533141 hartree
dispersion: -0.092677841 hartree
dispersion: -0.092487242 hartree
dispersion: -0.092584377 hartree
dispersion: -0.092673901 hartree
dispersion: -0.092756990 hartree
dispersion: -0.092778984 hartree
dispersion: -0.092763841 hartree
dispersion: -0.092733419 hartree
dispersion: -0.092694933 hartree
dispersion: -0.092667522 hartree
dispersion: -0.092658540 hartree
dispersion: -0.092640910 hartree
dispersion: -0.092629123 hartree
dispersion: -0.092607505 hartree
dispersion: -0.092596266 hartree
dispersion: -0.092591243 hartree
dispersion: -0.092589684 hartree
dispersion: -0.092599205 hartree
dispersion: -0.092601084 hartree
dispersion: -0.092605785 hartree
dispersion: -0.092607847 hartree
dispersion: -0.092609243 hartree
dispersion: -0.092608478 hartree
dispersion: -0.092609094 hartree
dispersion: -0.092609146 hartree
dispersion: -0.092609216 hartree
dispersion: -0.092609654 hartree
elementType: N O C H Li F
energy: -674.6457 -674.6081 -674.5856 -524.5181 -523.9589 -523.7945 -520.8588 -392.5642 -283.2702 -282.6779 -282.6582 -282.4468 -281.2543 -281.2535 -281.1845 -281.0852 -281.0201 -280.6055 -280.3098 -280.2629 -280.0880 -279.8632 -279.3067 -54.8219 -37.1039 -36.8035 -36.5253 -33.3032 -32.0642 -31.9046 -30.2920 -27.6528 -25.8473 -24.6056 -24.2017 -23.6422 -23.3131 -23.1500 -22.9751 -20.9828 -20.7928 -20.6648 -20.6249 -20.5411 -19.0893 -18.7701 -18.1400 -18.0505 -17.1060 -17.0211 -16.8105 -16.6734 -16.5202 -16.4146 -16.3604 -16.2470 -16.1337 -16.0960 -16.0766 -15.6377 -15.6269 -15.5749 -15.4887 -15.2202 -14.9576 -14.7539 -14.4693 -14.0930 -13.8575 -13.7899 -13.7119 -13.5727 -13.4065 -13.2322 -13.1873 -13.0855 -12.9572 -12.4920 -12.4292 -12.2238 -12.1785 -11.9805 -10.6141 -10.5611 -10.4391 -10.2539 -9.5878 -8.8268 -7.9794 -7.0004 1.4362 1.4715 1.6884 1.9512 3.7627 3.8425 3.9846 4.1116 4.4895 4.5173 4.6932 electronvolt
chargesum: -0.0000000
charge: -0.141505 -0.850817 0.143969 0.142401 0.016495 0.088913 0.026501 0.002183 0.019193 0.016720 0.015074 0.026767 0.348251 -0.289183 -0.343177 0.924957 -0.879274 -0.851369 0.242886 0.047708 0.047030 0.066579 0.243270 0.051888 0.071774 0.048469 0.272411 0.047919 0.073928 0.046305 0.232381 0.041538 0.073616 0.038217 0.108515 -0.135591 -0.113565 0.231356 0.045661 0.229168 0.035460 0.136115 -0.201902 -0.195111 -0.202125
charge: 0.048367 -0.813840 0.059974 0.035806 0.029715 -0.039369 0.028785 0.014594 0.020212 0.023649 0.022896 0.037528 0.374737 -0.146668 -0.317276 0.365851 -0.566645 -0.555317 0.197802 0.048757 0.047623 0.069385 0.196084 0.047439 0.064539 0.047646 0.193560 0.045826 0.064594 0.046756 0.199733 0.045253 0.079530 0.045952 0.018490 -0.072448 -0.070100 0.069106 0.051129 0.069116 0.054892 0.007594 -0.064215 -0.062513 -0.064531
qa: -0.1415 -0.8508 0.1440 0.1424 0.0165 0.0889 0.0265 0.0022 0.0192 0.0167 0.0151 0.0268 0.3483 -0.2892 -0.3432 0.9250 -0.8793 -0.8514 0.2429 0.0477 0.0470 0.0666 0.2433 0.0519 0.0718 0.0485 0.2724 0.0479 0.0739 0.0463 0.2324 0.0415 0.0736 0.0382 0.1085 -0.1356 -0.1136 0.2314 0.0457 0.2292 0.0355 0.1361 -0.2019 -0.1951 -0.2021
va: 3.1749 1.3272 3.9705 3.8914 0.9907 3.9135 0.9876 1.0025 0.9920 1.0015 0.9937 1.0112 3.9258 3.8547 2.1724 0.2085 2.0113 2.0462 3.8395 0.9830 0.9814 0.9915 3.8411 0.9807 0.9873 0.9836 3.8384 0.9768 0.9814 0.9803 3.8432 0.9819 1.0002 0.9815 3.7947 3.8267 3.7921 3.8546 1.0079 3.8647 1.0113 3.7862 1.1578 1.1706 1.1575
dispersion: -0.092608587 hartree
energy: -1246.394072998030 hartree
dipole: 55.116536181 -51.998419535 3.118116646 0.388034695 -2.646683788 -2.258649093 -15.197437242 15.097048097 -0.100389146
dipolemethod: SCF
magnitude: 3.851522443 au
magnitude: 9.789792042 debye
temp: 298.15 k
press: 1.00 atm
zeropoint: 0.35210995 hartree
thermalvibcorrection: 0.02507361 hartree
thermalrotcorrection: 0.00141627 hartree
thermaltrasncorrection: 0.00141627 hartree
thermaltotal: -1246.01405689 hartree
thermalcorr: 0.02790616 hartree
nonthermalcorr: 0.35210995 hartree
totalcorr: 0.38001610 hartree
thermalcorrenthalpy: 0.00094421 hartree
totalenthalpy: -1246.01311268 hartree
vibrat: 0.04637321 hartree
rotat: 0.01687956 hartree
transl: 0.02061800 hartree
total: 0.08387077 hartree
totalentropycorr: -0.08387077 hartree
gibbsenthalpy: -1246.09698345 hartree
gibbsminuselec: 0.29708954 hartree
